Build 'widgets :: auth0.js' #165 
Started 'Tue Apr 15 14:10:49 UTC 2014' on 'Agent Smith' by 'Git'
Finished 'Tue Apr 15 14:13:58 UTC 2014' with status 'FAILURE Some tests failed.'
TeamCity URL http://auth0-ci.cloudapp.net/viewLog.html?buildId=14215&buildTypeId=bt21 
TeamCity server version is 7.1.5 (build 24400)

[14:10:47]: bt21 (3m:11s)
[14:10:47]: Checking for changes (running for 25h:48m:36s)
[14:10:49]: Publishing internal artifacts
[14:10:49]:	 [Publishing internal artifacts] Sending build.start.properties.gz file
[14:10:49]: Clearing temporary directory: /opt/TeamCity-Agent2/temp/buildTmp
[14:10:49]: Clean build enabled: removing old files from /opt/TeamCity-Agent2/work/123a5dccb469ff43
[14:10:49]: Checkout directory: /opt/TeamCity-Agent2/work/123a5dccb469ff43
[14:10:49]: Updating sources: server side checkout
[14:10:49]:	 [Updating sources] Will perform clean checkout. Reason: "Clean all files before build" turned on
[14:10:49]:	 [Updating sources] Transferring cached clean patch for VCS root: auth0.js
[14:10:49]:	 [Updating sources] Building incremental patch over the cached patch
[14:10:49]:	 [Updating sources] Repository sources transferred: 647.32Kb total
[14:10:49]:	 [Updating sources] Removing /opt/TeamCity-Agent2/work/123a5dccb469ff43
[14:10:49]:	 [Updating sources] Updating /opt/TeamCity-Agent2/work/123a5dccb469ff43
[14:10:49]: Build preparation done
[14:10:49]: Starting: /opt/TeamCity-Agent2/temp/agentTmp/custom_script798414496794624950
[14:10:49]: in directory: /opt/TeamCity-Agent2/work/123a5dccb469ff43
[14:10:49]:   attempt 1  : npm install 
[14:10:50]: npm http GET http://localhost:4873/Base64
[14:10:50]: npm http GET https://github.com/jfromaniello/node-querystring/tarball/master
[14:10:50]: npm http GET https://github.com/jfromaniello/debug/tarball/master
[14:10:50]: npm http GET http://localhost:4873/reqwest
[14:10:50]: npm http GET http://localhost:4873/jsonp/0.0.3
[14:10:50]: npm http GET http://localhost:4873/xtend
[14:10:50]: npm http GET http://localhost:4873/browserify
[14:10:50]: npm http GET http://localhost:4873/uglify-js
[14:10:50]: npm http GET https://github.com/siacomuzzi/grunt-maxcdn/tarball/0.0.1
[14:10:50]: npm http GET http://localhost:4873/grunt
[14:10:50]: npm http GET http://localhost:4873/grunt-cli
[14:10:50]: npm http GET http://localhost:4873/grunt-exec
[14:10:50]: npm http GET http://localhost:4873/grunt-contrib-connect
[14:10:50]: npm http GET http://localhost:4873/grunt-browserify
[14:10:50]: npm http GET http://localhost:4873/grunt-contrib-uglify
[14:10:50]: npm http GET http://localhost:4873/grunt-contrib-copy
[14:10:50]: npm http GET http://localhost:4873/grunt-contrib-watch
[14:10:50]: npm http GET http://localhost:4873/rimraf
[14:10:50]: npm http GET http://localhost:4873/expect.js
[14:10:50]: npm http GET http://localhost:4873/grunt-contrib-clean
[14:10:50]: npm http GET http://localhost:4873/mocha
[14:10:50]: npm http GET http://localhost:4873/grunt-s3
[14:10:50]: npm http GET http://localhost:4873/testem
[14:10:50]: npm http 304 http://localhost:4873/jsonp/0.0.3
[14:10:51]: npm http 304 http://localhost:4873/uglify-js
[14:10:51]: npm http 304 http://localhost:4873/Base64
[14:10:51]: npm http 200 https://github.com/jfromaniello/debug/tarball/master
[14:10:51]: npm http 200 https://github.com/jfromaniello/node-querystring/tarball/master
[14:10:51]: npm http 200 https://github.com/siacomuzzi/grunt-maxcdn/tarball/0.0.1
[14:10:51]: npm http 304 http://localhost:4873/grunt
[14:10:51]: npm http 304 http://localhost:4873/grunt-cli
[14:10:51]: npm http 304 http://localhost:4873/grunt-exec
[14:10:51]: npm http 304 http://localhost:4873/grunt-contrib-connect
[14:10:52]: npm http 304 http://localhost:4873/browserify
[14:10:52]: npm http 304 http://localhost:4873/grunt-contrib-uglify
[14:10:52]: npm http 304 http://localhost:4873/grunt-browserify
[14:10:52]: npm http 304 http://localhost:4873/grunt-contrib-watch
[14:10:52]: npm http 304 http://localhost:4873/rimraf
[14:10:52]: npm http 304 http://localhost:4873/expect.js
[14:10:53]: npm http 304 http://localhost:4873/mocha
[14:10:53]: npm http 304 http://localhost:4873/grunt-s3
[14:10:53]: npm http 304 http://localhost:4873/grunt-contrib-copy
[14:10:54]: npm http 304 http://localhost:4873/grunt-contrib-clean
[14:10:54]: npm http 304 http://localhost:4873/testem
[14:10:56]: npm http 304 http://localhost:4873/xtend
[14:11:01]: npm http 304 http://localhost:4873/reqwest
[14:11:02]: npm http GET http://localhost:4873/maxcdn/0.1.3
[14:11:02]: npm http GET http://localhost:4873/object-keys
[14:11:02]: npm http GET http://localhost:4873/nopt
[14:11:02]: npm http GET http://localhost:4873/findup-sync
[14:11:02]: npm http GET http://localhost:4873/connect
[14:11:02]: npm http GET http://localhost:4873/connect-livereload
[14:11:02]: npm http GET http://localhost:4873/resolve
[14:11:02]: npm http GET http://localhost:4873/open/0.0.4
[14:11:02]: npm http GET http://localhost:4873/underscore.deferred
[14:11:02]: npm http GET http://localhost:4873/knox
[14:11:02]: npm http GET http://localhost:4873/gaze
[14:11:02]: npm http GET http://localhost:4873/async
[14:11:02]: npm http GET http://localhost:4873/coffee-script
[14:11:02]: npm http GET http://localhost:4873/grunt-lib-contrib
[14:11:02]: npm http GET http://localhost:4873/mime
[14:11:02]: npm http GET http://localhost:4873/colors
[14:11:02]: npm http GET http://localhost:4873/temporary/0.0.5
[14:11:02]: npm http GET http://localhost:4873/dateformat/1.0.2-1.2.3
[14:11:02]: npm http GET http://localhost:4873/eventemitter2
[14:11:02]: npm http GET http://localhost:4873/findup-sync
[14:11:02]: npm http GET http://localhost:4873/glob
[14:11:02]: npm http GET http://localhost:4873/hooker
[14:11:02]: npm http GET http://localhost:4873/iconv-lite
[14:11:02]: npm http GET http://localhost:4873/minimatch
[14:11:02]: npm http GET http://localhost:4873/lodash
[14:11:02]: npm http GET http://localhost:4873/underscore.string
[14:11:02]: npm http GET http://localhost:4873/which
[14:11:02]: npm http GET http://localhost:4873/js-yaml
[14:11:02]: npm http GET http://localhost:4873/exit
[14:11:02]: npm http GET http://localhost:4873/getobject
[14:11:02]: npm http GET http://localhost:4873/grunt-legacy-util
[14:11:02]: npm http GET http://localhost:4873/commander/0.6.1
[14:11:02]: npm http GET http://localhost:4873/growl
[14:11:02]: npm http GET http://localhost:4873/jade/0.26.3
[14:11:02]: npm http GET http://localhost:4873/diff/1.0.7
[14:11:02]: npm http GET http://localhost:4873/mkdirp/0.3.5
[14:11:02]: npm http GET http://localhost:4873/glob/3.2.3
[14:11:02]: npm http 304 http://localhost:4873/findup-sync
[14:11:02]: npm http GET http://localhost:4873/async
[14:11:02]: npm http GET http://localhost:4873/source-map
[14:11:02]: npm http GET http://localhost:4873/uglify-to-browserify
[14:11:02]: npm http GET http://localhost:4873/optimist
[14:11:02]: npm http 304 http://localhost:4873/object-keys
[14:11:02]: npm http 304 http://localhost:4873/maxcdn/0.1.3
[14:11:02]: npm http GET http://localhost:4873/oauth
[14:11:02]: npm http GET http://localhost:4873/module-deps
[14:11:03]: npm http GET http://localhost:4873/browser-pack
[14:11:03]: npm http 304 http://localhost:4873/open/0.0.4
[14:11:03]: npm http GET http://localhost:4873/deps-sort
[14:11:03]: npm http GET http://localhost:4873/shell-quote
[14:11:03]: npm http GET http://localhost:4873/through
[14:11:03]: npm http GET http://localhost:4873/duplexer
[14:11:03]: npm http GET http://localhost:4873/stream-combiner
[14:11:03]: npm http GET http://localhost:4873/concat-stream
[14:11:03]: npm http GET http://localhost:4873/insert-module-globals
[14:11:03]: npm http GET http://localhost:4873/syntax-error
[14:11:03]: npm http GET http://localhost:4873/browser-resolve
[14:11:03]: npm http GET http://localhost:4873/browser-builtins/2.0.5
[14:11:03]: npm http GET http://localhost:4873/inherits
[14:11:03]: npm http GET http://localhost:4873/optimist
[14:11:03]: npm http GET http://localhost:4873/JSONStream
[14:11:03]: npm http GET http://localhost:4873/umd
[14:11:03]: npm http GET http://localhost:4873/parents
[14:11:03]: npm http GET http://localhost:4873/deep-equal
[14:11:03]: npm http 304 http://localhost:4873/resolve
[14:11:03]: npm http 304 http://localhost:4873/underscore.deferred
[14:11:03]: npm http 304 http://localhost:4873/connect-livereload
[14:11:03]: npm http 304 http://localhost:4873/knox
[14:11:03]: npm http 304 http://localhost:4873/async
[14:11:03]: npm http GET http://localhost:4873/browserify-shim
[14:11:03]: npm http GET http://localhost:4873/lodash
[14:11:03]: npm http 304 http://localhost:4873/gaze
[14:11:03]: npm http GET http://localhost:4873/minimatch
[14:11:03]: npm http GET http://localhost:4873/fileset
[14:11:04]: npm http 304 http://localhost:4873/grunt-lib-contrib
[14:11:04]: npm http 304 http://localhost:4873/coffee-script
[14:11:04]: npm http GET http://localhost:4873/zlib-browserify/0.0.1
[14:11:04]: npm http GET http://localhost:4873/commander
[14:11:04]: npm http GET http://localhost:4873/tap
[14:11:04]: npm http GET http://localhost:4873/backbone
[14:11:04]: npm http GET http://localhost:4873/styled_string
[14:11:04]: npm http GET http://localhost:4873/colors
[14:11:04]: npm http GET http://localhost:4873/fileset
[14:11:04]: npm http GET http://localhost:4873/growl
[14:11:04]: npm http GET http://localhost:4873/consolidate
[14:11:04]: npm http GET http://localhost:4873/did_it_work
[14:11:04]: npm http GET http://localhost:4873/fireworm
[14:11:04]: npm http GET http://localhost:4873/mustache
[14:11:04]: npm http GET http://localhost:4873/socket.io
[14:11:04]: npm http GET http://localhost:4873/winston
[14:11:04]: npm http GET http://localhost:4873/charm
[14:11:04]: npm http GET http://localhost:4873/js-yaml
[14:11:04]: npm http 304 http://localhost:4873/mime
[14:11:04]: npm http 304 http://localhost:4873/colors
[14:11:04]: npm http 304 http://localhost:4873/eventemitter2
[14:11:04]: npm http 304 http://localhost:4873/temporary/0.0.5
[14:11:04]: npm http 304 http://localhost:4873/dateformat/1.0.2-1.2.3
[14:11:04]: npm http GET http://localhost:4873/stream-counter
[14:11:04]: npm http GET http://localhost:4873/xml2js
[14:11:04]: npm http GET http://localhost:4873/package
[14:11:04]: npm http 304 http://localhost:4873/findup-sync
[14:11:04]: npm http 304 http://localhost:4873/hooker
[14:11:04]: npm http 304 http://localhost:4873/glob
[14:11:05]: npm http 304 http://localhost:4873/iconv-lite
[14:11:05]: npm http 304 http://localhost:4873/lodash
[14:11:05]: npm http 304 http://localhost:4873/underscore.string
[14:11:05]: npm http 304 http://localhost:4873/which
[14:11:05]: npm http 304 http://localhost:4873/minimatch
[14:11:05]: npm http 304 http://localhost:4873/js-yaml
[14:11:05]: npm http 304 http://localhost:4873/exit
[14:11:05]: npm http 304 http://localhost:4873/getobject
[14:11:06]: npm http 304 http://localhost:4873/grunt-legacy-util
[14:11:06]: npm http 304 http://localhost:4873/commander/0.6.1
[14:11:06]: npm http 304 http://localhost:4873/growl
[14:11:06]: npm http 304 http://localhost:4873/mkdirp/0.3.5
[14:11:06]: npm http 304 http://localhost:4873/jade/0.26.3
[14:11:06]: npm http 304 http://localhost:4873/diff/1.0.7
[14:11:06]: npm http 304 http://localhost:4873/async
[14:11:06]: npm http 304 http://localhost:4873/source-map
[14:11:06]: npm http 304 http://localhost:4873/glob/3.2.3
[14:11:06]: npm http 304 http://localhost:4873/oauth
[14:11:06]: npm http 304 http://localhost:4873/optimist
[14:11:06]: npm http GET http://localhost:4873/graceful-fs
[14:11:06]: npm http GET http://localhost:4873/inherits
[14:11:06]: npm http GET http://localhost:4873/mkdirp/0.3.0
[14:11:06]: npm http 304 http://localhost:4873/uglify-to-browserify
[14:11:07]: npm http GET http://localhost:4873/wordwrap
[14:11:07]: npm http GET http://localhost:4873/amdefine
[14:11:07]: npm http 304 http://localhost:4873/deps-sort
[14:11:07]: npm http 304 http://localhost:4873/module-deps
[14:11:07]: npm http 304 http://localhost:4873/browser-pack
[14:11:07]: npm http 304 http://localhost:4873/shell-quote
[14:11:07]: npm http 304 http://localhost:4873/duplexer
[14:11:07]: npm http 304 http://localhost:4873/nopt
[14:11:07]: npm http 304 http://localhost:4873/stream-combiner
[14:11:07]: npm http 304 http://localhost:4873/connect
[14:11:07]: npm http 304 http://localhost:4873/through
[14:11:08]: npm http 304 http://localhost:4873/concat-stream
[14:11:08]: npm http 304 http://localhost:4873/syntax-error
[14:11:08]: npm http 304 http://localhost:4873/insert-module-globals
[14:11:08]: npm http 304 http://localhost:4873/inherits
[14:11:08]: npm http 304 http://localhost:4873/browser-resolve
[14:11:08]: npm http GET http://localhost:4873/abbrev
[14:11:08]: npm http 304 http://localhost:4873/optimist
[14:11:08]: npm http 304 http://localhost:4873/JSONStream
[14:11:08]: npm http GET http://localhost:4873/lru-cache
[14:11:08]: npm http GET http://localhost:4873/sigmund
[14:11:08]: npm http GET http://localhost:4873/graceful-fs
[14:11:08]: npm http 304 http://localhost:4873/browser-builtins/2.0.5
[14:11:08]: npm http GET http://localhost:4873/argparse
[14:11:08]: npm http GET http://localhost:4873/esprima
[14:11:08]: npm http 304 http://localhost:4873/deep-equal
[14:11:08]: npm http 304 http://localhost:4873/umd
[14:11:08]: npm http 304 http://localhost:4873/parents
[14:11:09]: npm http 304 http://localhost:4873/fileset
[14:11:09]: npm http 304 http://localhost:4873/minimatch
[14:11:09]: npm http 304 http://localhost:4873/zlib-browserify/0.0.1
[14:11:09]: npm http 304 http://localhost:4873/browserify-shim
[14:11:09]: npm http 304 http://localhost:4873/lodash
[14:11:09]: npm http GET http://localhost:4873/formidable/1.0.14
[14:11:09]: npm http GET http://localhost:4873/cookie-signature/1.0.1
[14:11:09]: npm http GET http://localhost:4873/buffer-crc32/0.2.1
[14:11:09]: npm http GET http://localhost:4873/cookie/0.0.5
[14:11:09]: npm http GET http://localhost:4873/send/0.1.1
[14:11:09]: npm http GET http://localhost:4873/bytes/0.2.0
[14:11:09]: npm http GET http://localhost:4873/fresh/0.1.0
[14:11:09]: npm http GET http://localhost:4873/pause/0.0.1
[14:11:09]: npm http 304 http://localhost:4873/styled_string
[14:11:09]: npm http 304 http://localhost:4873/backbone
[14:11:09]: npm http 304 http://localhost:4873/colors
[14:11:09]: npm http 304 http://localhost:4873/commander
[14:11:09]: npm http GET http://localhost:4873/bops/0.0.6
[14:11:09]: npm http GET http://localhost:4873/minimist
[14:11:09]: npm http GET http://localhost:4873/esprima
[14:11:09]: npm http GET http://localhost:4873/rfile
[14:11:09]: npm http GET http://localhost:4873/ruglify
[14:11:09]: npm http 304 http://localhost:4873/fileset
[14:11:09]: npm http GET http://localhost:4873/resolve/0.5.1
[14:11:09]: npm http GET http://localhost:4873/combine-source-map
[14:11:09]: npm http GET http://localhost:4873/commondir
[14:11:09]: npm http GET http://localhost:4873/lexical-scope
[14:11:09]: npm http GET http://localhost:4873/process
[14:11:09]: npm http 304 http://localhost:4873/growl
[14:11:09]: npm http GET http://localhost:4873/detective
[14:11:09]: npm http 304 http://localhost:4873/consolidate
[14:11:10]: npm http 304 http://localhost:4873/tap
[14:11:10]: npm http GET http://localhost:4873/jsonparse/0.0.5
[14:11:10]: npm http 304 http://localhost:4873/did_it_work
[14:11:10]: npm http 304 http://localhost:4873/fireworm
[14:11:10]: npm http 304 http://localhost:4873/socket.io
[14:11:10]: npm http GET http://localhost:4873/punycode
[14:11:10]: npm http GET http://localhost:4873/vm-browserify
[14:11:10]: npm http GET http://localhost:4873/console-browserify
[14:11:10]: npm http GET http://localhost:4873/crypto-browserify
[14:11:10]: npm http GET http://localhost:4873/http-browserify
[14:11:10]: npm http GET http://localhost:4873/buffer-browserify
[14:11:10]: npm http GET http://localhost:4873/zlib-browserify
[14:11:10]: npm http GET http://localhost:4873/constants-browserify
[14:11:10]: npm http GET http://localhost:4873/os-browserify
[14:11:10]: npm http 304 http://localhost:4873/mustache
[14:11:10]: npm http 304 http://localhost:4873/winston
[14:11:10]: npm http 304 http://localhost:4873/stream-counter
[14:11:10]: npm http 304 http://localhost:4873/xml2js
[14:11:10]: npm http GET http://localhost:4873/readable-stream
[14:11:10]: npm http GET http://localhost:4873/sax
[14:11:10]: npm http 304 http://localhost:4873/charm
[14:11:10]: npm http 304 http://localhost:4873/package
[14:11:10]: npm http 304 http://localhost:4873/inherits
[14:11:10]: npm http 304 http://localhost:4873/js-yaml
[14:11:10]: npm http 304 http://localhost:4873/graceful-fs
[14:11:10]: npm http 304 http://localhost:4873/mkdirp/0.3.0
[14:11:11]: npm http 304 http://localhost:4873/lru-cache
[14:11:11]: npm http 304 http://localhost:4873/amdefine
[14:11:11]: npm http 304 http://localhost:4873/abbrev
[14:11:11]: npm http 304 http://localhost:4873/wordwrap
[14:11:11]: npm http 304 http://localhost:4873/graceful-fs
[14:11:11]: npm http 304 http://localhost:4873/formidable/1.0.14
[14:11:11]: npm http 304 http://localhost:4873/sigmund
[14:11:11]: npm http 304 http://localhost:4873/argparse
[14:11:11]: npm http 304 http://localhost:4873/buffer-crc32/0.2.1
[14:11:11]: npm http 304 http://localhost:4873/cookie-signature/1.0.1
[14:11:11]: npm http 304 http://localhost:4873/cookie/0.0.5
[14:11:11]: npm http 304 http://localhost:4873/esprima
[14:11:11]: npm http GET http://localhost:4873/underscore
[14:11:11]: npm http 304 http://localhost:4873/send/0.1.1
[14:11:11]: npm http GET http://localhost:4873/socket.io-client/0.9.16
[14:11:11]: npm http GET http://localhost:4873/policyfile/0.0.4
[14:11:11]: npm http GET http://localhost:4873/base64id/0.1.0
[14:11:11]: npm http GET http://localhost:4873/redis/0.7.3
[14:11:11]: npm http 304 http://localhost:4873/fresh/0.1.0
[14:11:11]: npm http 304 http://localhost:4873/bytes/0.2.0
[14:11:12]: npm http 304 http://localhost:4873/minimist
[14:11:12]: npm http 304 http://localhost:4873/pause/0.0.1
[14:11:12]: npm http 304 http://localhost:4873/bops/0.0.6
[14:11:12]: npm http GET http://localhost:4873/slide
[14:11:12]: npm http GET http://localhost:4873/runforcover
[14:11:12]: npm http GET http://localhost:4873/mkdirp
[14:11:12]: npm http GET http://localhost:4873/difflet
[14:11:12]: npm http GET http://localhost:4873/buffer-equal
[14:11:12]: npm http 304 http://localhost:4873/ruglify
[14:11:12]: npm http 304 http://localhost:4873/esprima
[14:11:12]: npm http 304 http://localhost:4873/resolve/0.5.1
[14:11:12]: npm http 304 http://localhost:4873/rfile
[14:11:12]: npm http GET http://localhost:4873/cycle
[14:11:12]: npm http GET http://localhost:4873/eyes
[14:11:12]: npm http GET http://localhost:4873/pkginfo
[14:11:12]: npm http GET http://localhost:4873/request
[14:11:12]: npm http GET http://localhost:4873/stack-trace
[14:11:12]: npm http 304 http://localhost:4873/combine-source-map
[14:11:12]: npm http GET http://localhost:4873/range-parser/0.0.4
[14:11:12]: npm http 304 http://localhost:4873/lexical-scope
[14:11:12]: npm http 304 http://localhost:4873/commondir
[14:11:12]: npm http 304 http://localhost:4873/process
[14:11:12]: npm http GET http://localhost:4873/underscore
[14:11:12]: npm http 304 http://localhost:4873/detective
[14:11:13]: npm http GET http://localhost:4873/base64-js/0.0.2
[14:11:13]: npm http GET http://localhost:4873/to-utf8/0.0.1
[14:11:13]: npm http 304 http://localhost:4873/console-browserify
[14:11:13]: npm http 304 http://localhost:4873/jsonparse/0.0.5
[14:11:13]: npm http 304 http://localhost:4873/vm-browserify
[14:11:13]: npm http GET http://localhost:4873/callsite
[14:11:13]: npm http GET http://localhost:4873/resolve
[14:11:13]: npm http 304 http://localhost:4873/buffer-browserify
[14:11:13]: npm http 304 http://localhost:4873/punycode
[14:11:13]: npm http 304 http://localhost:4873/crypto-browserify
[14:11:13]: npm http GET http://localhost:4873/inline-source-map
[14:11:13]: npm http GET http://localhost:4873/convert-source-map
[14:11:13]: npm http 304 http://localhost:4873/zlib-browserify
[14:11:13]: npm http 304 http://localhost:4873/http-browserify
[14:11:13]: npm http GET http://localhost:4873/uglify-js
[14:11:13]: npm http GET http://localhost:4873/esprima/1.0.2
[14:11:13]: npm http GET http://localhost:4873/escodegen/0.0.15
[14:11:13]: npm http GET http://localhost:4873/astw
[14:11:13]: npm http 304 http://localhost:4873/os-browserify
[14:11:13]: npm http 304 http://localhost:4873/underscore
[14:11:13]: npm http 304 http://localhost:4873/readable-stream
[14:11:13]: npm http 304 http://localhost:4873/constants-browserify
[14:11:14]: npm http 304 http://localhost:4873/base64id/0.1.0
[14:11:14]: npm http 304 http://localhost:4873/redis/0.7.3
[14:11:14]: npm http 304 http://localhost:4873/sax
[14:11:14]: npm http 304 http://localhost:4873/policyfile/0.0.4
[14:11:14]: npm http 304 http://localhost:4873/socket.io-client/0.9.16
[14:11:14]: npm http GET http://localhost:4873/string_decoder
[14:11:14]: npm http GET http://localhost:4873/indexof/0.0.1
[14:11:14]: npm http GET http://localhost:4873/tape
[14:11:14]: npm http 304 http://localhost:4873/difflet
[14:11:14]: npm http 304 http://localhost:4873/slide
[14:11:14]: npm http 304 http://localhost:4873/runforcover
[14:11:14]: npm http 304 http://localhost:4873/mkdirp
[14:11:14]: npm http 304 http://localhost:4873/buffer-equal
[14:11:14]: npm http 304 http://localhost:4873/eyes
[14:11:14]: npm http 304 http://localhost:4873/request
[14:11:15]: npm http 304 http://localhost:4873/cycle
[14:11:15]: npm http 304 http://localhost:4873/stack-trace
[14:11:15]: npm http 304 http://localhost:4873/range-parser/0.0.4
[14:11:15]: npm http 304 http://localhost:4873/pkginfo
[14:11:15]: npm http 304 http://localhost:4873/base64-js/0.0.2
[14:11:15]: npm http 304 http://localhost:4873/to-utf8/0.0.1
[14:11:15]: npm http GET http://localhost:4873/bunker
[14:11:15]: npm http GET http://localhost:4873/traverse
[14:11:15]: npm http GET http://localhost:4873/deep-is
[14:11:15]: npm http 304 http://localhost:4873/callsite
[14:11:15]: npm http 304 http://localhost:4873/underscore
[14:11:15]: npm http 304 http://localhost:4873/resolve
[14:11:15]: npm http 304 http://localhost:4873/inline-source-map
[14:11:15]: npm http 304 http://localhost:4873/uglify-js
[14:11:15]: npm http 304 http://localhost:4873/convert-source-map
[14:11:16]: npm http 304 http://localhost:4873/esprima/1.0.2
[14:11:16]: npm http 304 http://localhost:4873/escodegen/0.0.15
[14:11:16]: npm http 304 http://localhost:4873/astw
[14:11:16]: npm http 304 http://localhost:4873/indexof/0.0.1
[14:11:16]: npm http GET http://localhost:4873/form-data
[14:11:16]: npm http GET http://localhost:4873/mime
[14:11:16]: npm http GET http://localhost:4873/hawk
[14:11:16]: npm http GET http://localhost:4873/node-uuid
[14:11:16]: npm http GET http://localhost:4873/cookie-jar
[14:11:16]: npm http GET http://localhost:4873/aws-sign
[14:11:16]: npm http GET http://localhost:4873/oauth-sign
[14:11:16]: npm http GET http://localhost:4873/forever-agent
[14:11:16]: npm http GET http://localhost:4873/tunnel-agent
[14:11:16]: npm http GET http://localhost:4873/json-stringify-safe
[14:11:16]: npm http GET http://localhost:4873/qs
[14:11:16]: npm http 304 http://localhost:4873/string_decoder
[14:11:16]: npm http 304 http://localhost:4873/bunker
[14:11:16]: npm http 304 http://localhost:4873/tape
[14:11:16]: npm http 304 http://localhost:4873/traverse
[14:11:16]: npm http 304 http://localhost:4873/mime
[14:11:16]: npm http 304 http://localhost:4873/hawk
[14:11:16]: npm http GET http://localhost:4873/source-map
[14:11:16]: npm http 304 http://localhost:4873/node-uuid
[14:11:16]: npm http GET http://localhost:4873/burrito
[14:11:16]: npm http 304 http://localhost:4873/cookie-jar
[14:11:16]: npm http GET http://localhost:4873/jsonify
[14:11:16]: npm http GET http://localhost:4873/defined
[14:11:16]: npm http 304 http://localhost:4873/deep-is
[14:11:16]: npm http GET http://localhost:4873/source-map
[14:11:17]: npm http 304 http://localhost:4873/aws-sign
[14:11:17]: npm http 304 http://localhost:4873/form-data
[14:11:17]: npm http 304 http://localhost:4873/tunnel-agent
[14:11:17]: npm http 304 http://localhost:4873/oauth-sign
[14:11:17]: npm http 304 http://localhost:4873/forever-agent
[14:11:17]: npm http 304 http://localhost:4873/json-stringify-safe
[14:11:17]: npm http 304 http://localhost:4873/burrito
[14:11:17]: npm http 304 http://localhost:4873/qs
[14:11:17]: npm http 304 http://localhost:4873/source-map
[14:11:17]: npm http 304 http://localhost:4873/defined
[14:11:17]: npm http 304 http://localhost:4873/source-map
[14:11:17]: npm http 304 http://localhost:4873/jsonify
[14:11:17]: npm http GET http://localhost:4873/uglify-js/1.2.5
[14:11:17]: npm http GET http://localhost:4873/ws
[14:11:17]: npm http GET http://localhost:4873/xmlhttprequest/1.4.2
[14:11:17]: npm http GET http://localhost:4873/active-x-obfuscator/0.0.1
[14:11:18]: npm http GET http://localhost:4873/combined-stream
[14:11:18]: npm http 304 http://localhost:4873/uglify-js/1.2.5
[14:11:18]: npm http 304 http://localhost:4873/xmlhttprequest/1.4.2
[14:11:18]: npm http GET http://localhost:4873/hoek
[14:11:18]: npm http GET http://localhost:4873/boom
[14:11:18]: npm http GET http://localhost:4873/cryptiles
[14:11:18]: npm http GET http://localhost:4873/sntp
[14:11:18]: npm http 304 http://localhost:4873/active-x-obfuscator/0.0.1
[14:11:18]: npm http 304 http://localhost:4873/ws
[14:11:18]: npm http 304 http://localhost:4873/combined-stream
[14:11:18]: npm http 304 http://localhost:4873/boom
[14:11:18]: npm http 304 http://localhost:4873/cryptiles
[14:11:18]: npm http 304 http://localhost:4873/sntp
[14:11:18]: npm http GET http://localhost:4873/zeparser/0.0.5
[14:11:18]: npm http GET http://localhost:4873/delayed-stream/0.0.5
[14:11:18]: npm http 304 http://localhost:4873/hoek
[14:11:19]: npm http 304 http://localhost:4873/zeparser/0.0.5
[14:11:19]: npm http GET http://localhost:4873/commander
[14:11:19]: npm http GET http://localhost:4873/nan
[14:11:19]: npm http GET http://localhost:4873/tinycolor
[14:11:19]: npm http GET http://localhost:4873/options
[14:11:19]: npm http 304 http://localhost:4873/delayed-stream/0.0.5
[14:11:19]: npm http 304 http://localhost:4873/tinycolor
[14:11:19]: npm http 304 http://localhost:4873/commander
[14:11:19]: npm http 304 http://localhost:4873/options
[14:11:19]: npm http 304 http://localhost:4873/nan
[14:11:19]: 
[14:11:19]: > ws@0.4.31 install /opt/TeamCity-Agent2/work/123a5dccb469ff43/node_modules/testem/node_modules/socket.io/node_modules/socket.io-client/node_modules/ws
[14:11:19]: > (node-gyp rebuild 2> builderror.log) || (exit 0)
[14:11:19]: 
[14:11:20]: make: Entering directory `/opt/TeamCity-Agent2/work/123a5dccb469ff43/node_modules/testem/node_modules/socket.io/node_modules/socket.io-client/node_modules/ws/build'
[14:11:20]:   CXX(target) Release/obj.target/bufferutil/src/bufferutil.o
[14:11:20]:   SOLINK_MODULE(target) Release/obj.target/bufferutil.node
[14:11:20]:   SOLINK_MODULE(target) Release/obj.target/bufferutil.node: Finished
[14:11:20]:   COPY Release/bufferutil.node
[14:11:21]:   CXX(target) Release/obj.target/validation/src/validation.o
[14:11:21]:   SOLINK_MODULE(target) Release/obj.target/validation.node
[14:11:21]:   SOLINK_MODULE(target) Release/obj.target/validation.node: Finished
[14:11:21]:   COPY Release/validation.node
[14:11:21]: make: Leaving directory `/opt/TeamCity-Agent2/work/123a5dccb469ff43/node_modules/testem/node_modules/socket.io/node_modules/socket.io-client/node_modules/ws/build'
[14:11:21]: jsonp@0.0.3 node_modules/jsonp
[14:11:21]: 
[14:11:21]: debug@0.7.3 node_modules/debug
[14:11:21]: 
[14:11:21]: qs@0.6.5 node_modules/qs
[14:11:21]: 
[14:11:21]: Base64@0.1.4 node_modules/Base64
[14:11:21]: 
[14:11:21]: grunt-exec@0.4.5 node_modules/grunt-exec
[14:11:21]: 
[14:11:21]: expect.js@0.2.0 node_modules/expect.js
[14:11:21]: 
[14:11:21]: grunt-contrib-clean@0.5.0 node_modules/grunt-contrib-clean
[14:11:21]: 
[14:11:21]: rimraf@2.2.6 node_modules/rimraf
[14:11:21]: 
[14:11:21]: grunt-contrib-copy@0.4.1 node_modules/grunt-contrib-copy
[14:11:21]: 
[14:11:21]: reqwest@0.9.7 node_modules/reqwest
[14:11:21]: 
[14:11:21]: xtend@2.1.2 node_modules/xtend
[14:11:21]: ��������� object-keys@0.4.0
[14:11:21]: 
[14:11:21]: grunt-maxcdn@0.0.1 node_modules/grunt-maxcdn
[14:11:21]: ��������� maxcdn@0.1.3 (oauth@0.9.11)
[14:11:21]: 
[14:11:21]: grunt-contrib-uglify@0.2.7 node_modules/grunt-contrib-uglify
[14:11:21]: ��������� grunt-lib-contrib@0.6.1 (zlib-browserify@0.0.1)
[14:11:21]: 
[14:11:21]: grunt-browserify@1.2.12 node_modules/grunt-browserify
[14:11:21]: ��������� through@2.3.4
[14:11:21]: ��������� async@0.2.10
[14:11:21]: ��������� browserify-shim@2.0.10
[14:11:21]: ��������� lodash@2.4.1
[14:11:21]: 
[14:11:21]: uglify-js@2.4.13 node_modules/uglify-js
[14:11:21]: ��������� uglify-to-browserify@1.0.2
[14:11:21]: ��������� async@0.2.10
[14:11:21]: ��������� source-map@0.1.33 (amdefine@0.1.0)
[14:11:21]: ��������� optimist@0.3.7 (wordwrap@0.0.2)
[14:11:21]: 
[14:11:21]: mocha@1.13.0 node_modules/mocha
[14:11:21]: ��������� diff@1.0.7
[14:11:21]: ��������� growl@1.7.0
[14:11:21]: ��������� commander@0.6.1
[14:11:21]: ��������� mkdirp@0.3.5
[14:11:21]: ��������� jade@0.26.3 (mkdirp@0.3.0)
[14:11:21]: ��������� glob@3.2.3 (inherits@2.0.1, graceful-fs@2.0.3, minimatch@0.2.14)
[14:11:21]: 
[14:11:21]: grunt-contrib-watch@0.2.0 node_modules/grunt-contrib-watch
[14:11:21]: ��������� gaze@0.3.4 (fileset@0.1.5, minimatch@0.2.14)
[14:11:21]: 
[14:11:21]: grunt-cli@0.1.13 node_modules/grunt-cli
[14:11:21]: ��������� resolve@0.3.1
[14:11:21]: ��������� nopt@1.0.10 (abbrev@1.0.4)
[14:11:21]: ��������� findup-sync@0.1.3 (lodash@2.4.1, glob@3.2.9)
[14:11:21]: 
[14:11:21]: grunt-contrib-connect@0.5.0 node_modules/grunt-contrib-connect
[14:11:21]: ��������� connect-livereload@0.2.0
[14:11:21]: ��������� open@0.0.4
[14:11:21]: ��������� connect@2.7.11 (fresh@0.1.0, cookie-signature@1.0.1, pause@0.0.1, bytes@0.2.0, buffer-crc32@0.2.1, cookie@0.0.5, formidable@1.0.14, send@0.1.1)
[14:11:21]: 
[14:11:21]: grunt-s3@0.2.0-alpha.3 node_modules/grunt-s3
[14:11:21]: ��������� mime@1.2.11
[14:11:21]: ��������� underscore.deferred@0.1.5
[14:11:21]: ��������� temporary@0.0.5 (package@1.0.1)
[14:11:21]: ��������� knox@0.8.9 (xml2js@0.2.8, stream-counter@0.1.0)
[14:11:21]: 
[14:11:21]: grunt@0.4.4 node_modules/grunt
[14:11:21]: ��������� dateformat@1.0.2-1.2.3
[14:11:21]: ��������� which@1.0.5
[14:11:21]: ��������� eventemitter2@0.4.13
[14:11:21]: ��������� getobject@0.1.0
[14:11:21]: ��������� colors@0.6.2
[14:11:21]: ��������� grunt-legacy-util@0.1.2
[14:11:21]: ��������� hooker@0.2.3
[14:11:21]: ��������� async@0.1.22
[14:11:21]: ��������� exit@0.1.2
[14:11:21]: ��������� lodash@0.9.2
[14:11:21]: ��������� coffee-script@1.3.3
[14:11:21]: ��������� underscore.string@2.2.1
[14:11:21]: ��������� iconv-lite@0.2.11
[14:11:21]: ��������� glob@3.1.21 (inherits@1.0.0, graceful-fs@1.2.3)
[14:11:21]: ��������� nopt@1.0.10 (abbrev@1.0.4)
[14:11:21]: ��������� minimatch@0.2.14 (sigmund@1.0.0, lru-cache@2.5.0)
[14:11:21]: ��������� findup-sync@0.1.3 (glob@3.2.9, lodash@2.4.1)
[14:11:21]: ��������� js-yaml@2.0.5 (esprima@1.0.4, argparse@0.1.15)
[14:11:21]: 
[14:11:21]: browserify@2.35.4 node_modules/browserify
[14:11:21]: ��������� stream-combiner@0.0.4
[14:11:21]: ��������� duplexer@0.1.1
[14:11:21]: ��������� shell-quote@0.0.1
[14:11:21]: ��������� deep-equal@0.1.2
[14:11:21]: ��������� parents@0.0.2
[14:11:21]: ��������� through@2.3.4
[14:11:21]: ��������� inherits@1.0.0
[14:11:21]: ��������� optimist@0.5.2 (wordwrap@0.0.2)
[14:11:21]: ��������� deps-sort@0.1.1 (minimist@0.0.8)
[14:11:21]: ��������� browser-resolve@1.1.4 (resolve@0.5.1)
[14:11:21]: ��������� JSONStream@0.6.4 (through@2.2.7, jsonparse@0.0.5)
[14:11:21]: ��������� concat-stream@1.0.1 (bops@0.0.6)
[14:11:21]: ��������� browser-pack@1.1.0 (combine-source-map@0.3.0)
[14:11:21]: ��������� syntax-error@0.0.1 (esprima@0.9.9)
[14:11:21]: ��������� browser-builtins@2.0.5 (constants-browserify@0.0.1, os-browserify@0.1.2, console-browserify@1.0.3, punycode@1.2.4, http-browserify@0.1.14, buffer-browserify@0.2.2, crypto-browserify@1.0.9, vm-browserify@0.0.4, zlib-browserify@0.0.3)
[14:11:21]: ��������� insert-module-globals@1.3.1 (process@0.5.2, commondir@0.0.1, duplexer@0.0.4, through@2.2.7, JSONStream@0.4.4, lexical-scope@0.0.15)
[14:11:21]: ��������� module-deps@1.0.2 (minimist@0.0.8, resolve@0.4.3, detective@2.1.2)
[14:11:21]: ��������� umd@1.3.1 (rfile@1.0.0, ruglify@1.0.0)
[14:11:21]: 
[14:11:21]: testem@0.5.15 node_modules/testem
[14:11:21]: ��������� mustache@0.4.0
[14:11:21]: ��������� growl@1.7.0
[14:11:21]: ��������� styled_string@0.0.1
[14:11:21]: ��������� commander@2.2.0
[14:11:21]: ��������� did_it_work@0.0.6
[14:11:21]: ��������� consolidate@0.8.0
[14:11:21]: ��������� colors@0.6.2
[14:11:21]: ��������� charm@0.0.8
[14:11:21]: ��������� async@0.2.10
[14:11:21]: ��������� fireworm@0.4.4 (minimatch@0.2.14)
[14:11:21]: ��������� glob@3.1.21 (inherits@1.0.0, graceful-fs@1.2.3, minimatch@0.2.14)
[14:11:21]: ��������� fileset@0.1.5 (minimatch@0.2.14)
[14:11:21]: ��������� backbone@1.0.0 (underscore@1.6.0)
[14:11:21]: ��������� js-yaml@2.1.3 (esprima@1.0.4, argparse@0.1.15)
[14:11:21]: ��������� tap@0.4.8 (deep-equal@0.0.0, buffer-equal@0.0.0, slide@1.1.5, mkdirp@0.3.5, nopt@2.2.0, glob@3.2.9, difflet@0.2.6, runforcover@0.0.2)
[14:11:21]: ��������� winston@0.7.3 (cycle@1.0.3, stack-trace@0.0.9, eyes@0.1.8, pkginfo@0.3.0, request@2.16.6)
[14:11:21]: ��������� socket.io@0.9.16 (base64id@0.1.0, policyfile@0.0.4, redis@0.7.3, socket.io-client@0.9.16)
[14:11:21]: Running tests
[14:11:22]: 
[14:11:22]: > auth0-js@2.0.12 test /opt/TeamCity-Agent2/work/123a5dccb469ff43
[14:11:22]: > grunt integration
[14:11:22]: 
[14:11:23]:  >>  Local Npm module "grunt-cli" not found. Is it installed?
[14:11:23]: 
[14:11:23]:  Running "exec:test-desktop" (exec) task 
[14:11:45]: not ok 1 Chrome 28.0 - Auth0 should fail to construct without a clientID
[14:11:45]:     ---
[14:11:45]:         message: >
[14:11:45]:             expected 'Auth0 is not defined' to match /clientID is required/
[14:11:45]:         stack: >
[14:11:45]:             Error: expected 'Auth0 is not defined' to match /clientID is required/
[14:11:45]:                 at Assertion.assert (http://localhost:7357/node_modules/expect.js/expect.js:99:13)
[14:11:45]:                 at Assertion.match (http://localhost:7357/node_modules/expect.js/expect.js:310:10)
[14:11:45]:                 at Assertion.throwError.Assertion.throwException (http://localhost:7357/node_modules/expect.js/expect.js:142:30)
[14:11:45]:                 at Context.<anonymous> (http://localhost:7357/test/tests.js:10:11)
[14:11:45]:                 at Test.Runnable.run (http://localhost:7357/node_modules/mocha/mocha.js:4217:32)
[14:11:45]:                 at Runner.runTest (http://localhost:7357/node_modules/mocha/mocha.js:4591:10)
[14:11:45]:                 at http://localhost:7357/node_modules/mocha/mocha.js:4637:12
[14:11:45]:                 at next (http://localhost:7357/node_modules/mocha/mocha.js:4517:14)
[14:11:45]:                 at http://localhost:7357/node_modules/mocha/mocha.js:4526:7
[14:11:45]:                 at next (http://localhost:7357/node_modules/mocha/mocha.js:4470:23)
[14:11:45]:     ...
[14:11:45]: not ok 2 Chrome 28.0 - Auth0 should fail to construct without a callbackURL
[14:11:45]:     ---
[14:11:45]:         message: >
[14:11:45]:             expected 'Auth0 is not defined' to match /callbackURL is required/
[14:11:45]:         stack: >
[14:11:45]:             Error: expected 'Auth0 is not defined' to match /callbackURL is required/
[14:11:45]:                 at Assertion.assert (http://localhost:7357/node_modules/expect.js/expect.js:99:13)
[14:11:45]:                 at Assertion.match (http://localhost:7357/node_modules/expect.js/expect.js:310:10)
[14:11:45]:                 at Assertion.throwError.Assertion.throwException (http://localhost:7357/node_modules/expect.js/expect.js:142:30)
[14:11:45]:                 at Context.<anonymous> (http://localhost:7357/test/tests.js:16:11)
[14:11:45]:                 at Test.Runnable.run (http://localhost:7357/node_modules/mocha/mocha.js:4217:32)
[14:11:45]:                 at Runner.runTest (http://localhost:7357/node_modules/mocha/mocha.js:4591:10)
[14:11:45]:                 at http://localhost:7357/node_modules/mocha/mocha.js:4637:12
[14:11:45]:                 at next (http://localhost:7357/node_modules/mocha/mocha.js:4517:14)
[14:11:45]:                 at http://localhost:7357/node_modules/mocha/mocha.js:4526:7
[14:11:45]:                 at next (http://localhost:7357/node_modules/mocha/mocha.js:4470:23)
[14:11:45]:     ...
[14:11:45]: not ok 3 Chrome 28.0 - Auth0 should fail to construct without a domain
[14:11:45]:     ---
[14:11:45]:         message: >
[14:11:45]:             expected 'Auth0 is not defined' to match /domain is required/
[14:11:45]:         stack: >
[14:11:45]:             Error: expected 'Auth0 is not defined' to match /domain is required/
[14:11:45]:                 at Assertion.assert (http://localhost:7357/node_modules/expect.js/expect.js:99:13)
[14:11:45]:                 at Assertion.match (http://localhost:7357/node_modules/expect.js/expect.js:310:10)
[14:11:45]:                 at Assertion.throwError.Assertion.throwException (http://localhost:7357/node_modules/expect.js/expect.js:142:30)
[14:11:45]:                 at Context.<anonymous> (http://localhost:7357/test/tests.js:22:11)
[14:11:45]:                 at Test.Runnable.run (http://localhost:7357/node_modules/mocha/mocha.js:4217:32)
[14:11:45]:                 at Runner.runTest (http://localhost:7357/node_modules/mocha/mocha.js:4591:10)
[14:11:45]:                 at http://localhost:7357/node_modules/mocha/mocha.js:4637:12
[14:11:45]:                 at next (http://localhost:7357/node_modules/mocha/mocha.js:4517:14)
[14:11:45]:                 at http://localhost:7357/node_modules/mocha/mocha.js:4526:7
[14:11:45]:                 at next (http://localhost:7357/node_modules/mocha/mocha.js:4470:23)
[14:11:45]:     ...
[14:11:45]: not ok 4 Chrome 28.0 - Auth0 should force constructor
[14:11:45]:     ---
[14:11:45]:         message: >
[14:11:45]:             Auth0 is not defined
[14:11:45]:         stack: >
[14:11:45]:             ReferenceError: Auth0 is not defined
[14:11:45]:                 at Context.<anonymous> (http://localhost:7357/test/tests.js:26:35)
[14:11:45]:                 at Test.Runnable.run (http://localhost:7357/node_modules/mocha/mocha.js:4217:32)
[14:11:45]:                 at Runner.runTest (http://localhost:7357/node_modules/mocha/mocha.js:4591:10)
[14:11:45]:                 at http://localhost:7357/node_modules/mocha/mocha.js:4637:12
[14:11:45]:                 at next (http://localhost:7357/node_modules/mocha/mocha.js:4517:14)
[14:11:45]:                 at http://localhost:7357/node_modules/mocha/mocha.js:4526:7
[14:11:45]:                 at next (http://localhost:7357/node_modules/mocha/mocha.js:4470:23)
[14:11:45]:                 at http://localhost:7357/node_modules/mocha/mocha.js:4494:5
[14:11:45]:                 at timeslice (http://localhost:7357/node_modules/mocha/mocha.js:5487:27)
[14:11:45]:     ...
[14:11:45]: not ok 5 Chrome 28.0 - Auth0 should redirect to /authorize with google (callbackOnLocationHash: on)
[14:11:45]:     ---
[14:11:45]:         message: >
[14:11:45]:             Auth0 is not defined
[14:11:45]:         stack: >
[14:11:45]:             ReferenceError: Auth0 is not defined
[14:11:45]:                 at Context.<anonymous> (http://localhost:7357/test/tests.js:38:17)
[14:11:45]:                 at Test.Runnable.run (http://localhost:7357/node_modules/mocha/mocha.js:4200:15)
[14:11:45]:                 at Runner.runTest (http://localhost:7357/node_modules/mocha/mocha.js:4591:10)
[14:11:45]:                 at http://localhost:7357/node_modules/mocha/mocha.js:4637:12
[14:11:45]:                 at next (http://localhost:7357/node_modules/mocha/mocha.js:4517:14)
[14:11:45]:                 at http://localhost:7357/node_modules/mocha/mocha.js:4526:7
[14:11:45]:                 at next (http://localhost:7357/node_modules/mocha/mocha.js:4470:23)
[14:11:45]:                 at http://localhost:7357/node_modules/mocha/mocha.js:4494:5
[14:11:45]:                 at timeslice (http://localhost:7357/node_modules/mocha/mocha.js:5487:27)
[14:11:45]:     ...
[14:11:45]: not ok 6 Chrome 28.0 - Auth0 should fail if auth0.login is called with {popup: true} and without callback
[14:11:45]:     ---
[14:11:45]:         message: >
[14:11:45]:             Auth0 is not defined
[14:11:45]:         stack: >
[14:11:45]:             ReferenceError: Auth0 is not defined
[14:11:45]:                 at Context.<anonymous> (http://localhost:7357/test/tests.js:68:17)
[14:11:45]:                 at Test.Runnable.run (http://localhost:7357/node_modules/mocha/mocha.js:4217:32)
[14:11:45]:                 at Runner.runTest (http://localhost:7357/node_modules/mocha/mocha.js:4591:10)
[14:11:45]:                 at http://localhost:7357/node_modules/mocha/mocha.js:4637:12
[14:11:45]:                 at next (http://localhost:7357/node_modules/mocha/mocha.js:4517:14)
[14:11:45]:                 at http://localhost:7357/node_modules/mocha/mocha.js:4526:7
[14:11:45]:                 at next (http://localhost:7357/node_modules/mocha/mocha.js:4470:23)
[14:11:45]:                 at http://localhost:7357/node_modules/mocha/mocha.js:4494:5
[14:11:45]:                 at timeslice (http://localhost:7357/node_modules/mocha/mocha.js:5487:27)
[14:11:45]:     ...
[14:11:45]: not ok 7 Chrome 28.0 - Auth0 should fail if auth0.loginWithPopup is called without callback
[14:11:45]:     ---
[14:11:45]:         message: >
[14:11:45]:             Auth0 is not defined
[14:11:45]:         stack: >
[14:11:45]:             ReferenceError: Auth0 is not defined
[14:11:45]:                 at Context.<anonymous> (http://localhost:7357/test/tests.js:81:17)
[14:11:45]:                 at Test.Runnable.run (http://localhost:7357/node_modules/mocha/mocha.js:4217:32)
[14:11:45]:                 at Runner.runTest (http://localhost:7357/node_modules/mocha/mocha.js:4591:10)
[14:11:45]:                 at http://localhost:7357/node_modules/mocha/mocha.js:4637:12
[14:11:45]:                 at next (http://localhost:7357/node_modules/mocha/mocha.js:4517:14)
[14:11:45]:                 at http://localhost:7357/node_modules/mocha/mocha.js:4526:7
[14:11:45]:                 at next (http://localhost:7357/node_modules/mocha/mocha.js:4470:23)
[14:11:45]:                 at http://localhost:7357/node_modules/mocha/mocha.js:4494:5
[14:11:45]:                 at timeslice (http://localhost:7357/node_modules/mocha/mocha.js:5487:27)
[14:11:45]:     ...
[14:11:45]: not ok 8 Chrome 28.0 - Auth0 should support to use signin as an alias for login
[14:11:45]:     ---
[14:11:45]:         message: >
[14:11:45]:             Auth0 is not defined
[14:11:45]:         stack: >
[14:11:45]:             ReferenceError: Auth0 is not defined
[14:11:45]:                 at Context.<anonymous> (http://localhost:7357/test/tests.js:95:17)
[14:11:45]:                 at Test.Runnable.run (http://localhost:7357/node_modules/mocha/mocha.js:4217:32)
[14:11:45]:                 at Runner.runTest (http://localhost:7357/node_modules/mocha/mocha.js:4591:10)
[14:11:45]:                 at http://localhost:7357/node_modules/mocha/mocha.js:4637:12
[14:11:45]:                 at next (http://localhost:7357/node_modules/mocha/mocha.js:4517:14)
[14:11:45]:                 at http://localhost:7357/node_modules/mocha/mocha.js:4526:7
[14:11:45]:                 at next (http://localhost:7357/node_modules/mocha/mocha.js:4470:23)
[14:11:45]:                 at http://localhost:7357/node_modules/mocha/mocha.js:4494:5
[14:11:45]:                 at timeslice (http://localhost:7357/node_modules/mocha/mocha.js:5487:27)
[14:11:45]:     ...
[14:11:45]: not ok 9 Chrome 28.0 - Auth0 should redirect to /authorize with google (callbackOnLocationHash: off)
[14:11:45]:     ---
[14:11:45]:         message: >
[14:11:45]:             Auth0 is not defined
[14:11:45]:         stack: >
[14:11:45]:             ReferenceError: Auth0 is not defined
[14:11:45]:                 at Context.<anonymous> (http://localhost:7357/test/tests.js:106:17)
[14:11:45]:                 at Test.Runnable.run (http://localhost:7357/node_modules/mocha/mocha.js:4200:15)
[14:11:45]:                 at Runner.runTest (http://localhost:7357/node_modules/mocha/mocha.js:4591:10)
[14:11:45]:                 at http://localhost:7357/node_modules/mocha/mocha.js:4637:12
[14:11:45]:                 at next (http://localhost:7357/node_modules/mocha/mocha.js:4517:14)
[14:11:45]:                 at http://localhost:7357/node_modules/mocha/mocha.js:4526:7
[14:11:45]:                 at next (http://localhost:7357/node_modules/mocha/mocha.js:4470:23)
[14:11:45]:                 at http://localhost:7357/node_modules/mocha/mocha.js:4494:5
[14:11:45]:                 at timeslice (http://localhost:7357/node_modules/mocha/mocha.js:5487:27)
[14:11:45]:     ...
[14:11:45]: not ok 10 Chrome 28.0 - Auth0 should return SSO data
[14:11:45]:     ---
[14:11:45]:         message: >
[14:11:45]:             Auth0 is not defined
[14:11:45]:         stack: >
[14:11:45]:             ReferenceError: Auth0 is not defined
[14:11:45]:                 at Context.<anonymous> (http://localhost:7357/test/tests.js:327:17)
[14:11:45]:                 at Test.Runnable.run (http://localhost:7357/node_modules/mocha/mocha.js:4200:15)
[14:11:45]:                 at Runner.runTest (http://localhost:7357/node_modules/mocha/mocha.js:4591:10)
[14:11:45]:                 at http://localhost:7357/node_modules/mocha/mocha.js:4637:12
[14:11:45]:                 at next (http://localhost:7357/node_modules/mocha/mocha.js:4517:14)
[14:11:45]:                 at http://localhost:7357/node_modules/mocha/mocha.js:4526:7
[14:11:45]:                 at next (http://localhost:7357/node_modules/mocha/mocha.js:4470:23)
[14:11:45]:                 at http://localhost:7357/node_modules/mocha/mocha.js:4494:5
[14:11:45]:                 at timeslice (http://localhost:7357/node_modules/mocha/mocha.js:5487:27)
[14:11:45]:     ...
[14:11:45]: not ok 11 Chrome 28.0 - Auth0 should return configured connections
[14:11:45]:     ---
[14:11:45]:         message: >
[14:11:45]:             Auth0 is not defined
[14:11:45]:         stack: >
[14:11:45]:             ReferenceError: Auth0 is not defined
[14:11:45]:                 at Context.<anonymous> (http://localhost:7357/test/tests.js:340:17)
[14:11:45]:                 at Test.Runnable.run (http://localhost:7357/node_modules/mocha/mocha.js:4200:15)
[14:11:45]:                 at Runner.runTest (http://localhost:7357/node_modules/mocha/mocha.js:4591:10)
[14:11:45]:                 at http://localhost:7357/node_modules/mocha/mocha.js:4637:12
[14:11:45]:                 at next (http://localhost:7357/node_modules/mocha/mocha.js:4517:14)
[14:11:45]:                 at http://localhost:7357/node_modules/mocha/mocha.js:4526:7
[14:11:45]:                 at next (http://localhost:7357/node_modules/mocha/mocha.js:4470:23)
[14:11:45]:                 at http://localhost:7357/node_modules/mocha/mocha.js:4494:5
[14:11:45]:                 at timeslice (http://localhost:7357/node_modules/mocha/mocha.js:5487:27)
[14:11:45]:     ...
[14:11:45]: not ok 12 Chrome 28.0 - Auth0 parseHash should be able to parse the profile
[14:11:45]:     ---
[14:11:45]:         message: >
[14:11:45]:             Auth0 is not defined
[14:11:45]:         stack: >
[14:11:45]:             ReferenceError: Auth0 is not defined
[14:11:45]:                 at Context.<anonymous> (http://localhost:7357/test/tests.js:139:19)
[14:11:45]:                 at Test.Runnable.run (http://localhost:7357/node_modules/mocha/mocha.js:4217:32)
[14:11:45]:                 at Runner.runTest (http://localhost:7357/node_modules/mocha/mocha.js:4591:10)
[14:11:45]:                 at http://localhost:7357/node_modules/mocha/mocha.js:4637:12
[14:11:45]:                 at next (http://localhost:7357/node_modules/mocha/mocha.js:4517:14)
[14:11:45]:                 at http://localhost:7357/node_modules/mocha/mocha.js:4526:7
[14:11:45]:                 at next (http://localhost:7357/node_modules/mocha/mocha.js:4470:23)
[14:11:45]:                 at http://localhost:7357/node_modules/mocha/mocha.js:4494:5
[14:11:45]:                 at timeslice (http://localhost:7357/node_modules/mocha/mocha.js:5487:27)
[14:11:45]:     ...
[14:11:45]: not ok 13 Chrome 28.0 - Auth0 parseHash should be able to parse the profile (if it starts with a slash)
[14:11:45]:     ---
[14:11:45]:         message: >
[14:11:45]:             Auth0 is not defined
[14:11:45]:         stack: >
[14:11:45]:             ReferenceError: Auth0 is not defined
[14:11:45]:                 at Context.<anonymous> (http://localhost:7357/test/tests.js:155:19)
[14:11:45]:                 at Test.Runnable.run (http://localhost:7357/node_modules/mocha/mocha.js:4217:32)
[14:11:45]:                 at Runner.runTest (http://localhost:7357/node_modules/mocha/mocha.js:4591:10)
[14:11:45]:                 at http://localhost:7357/node_modules/mocha/mocha.js:4637:12
[14:11:45]:                 at next (http://localhost:7357/node_modules/mocha/mocha.js:4517:14)
[14:11:45]:                 at http://localhost:7357/node_modules/mocha/mocha.js:4526:7
[14:11:45]:                 at next (http://localhost:7357/node_modules/mocha/mocha.js:4470:23)
[14:11:45]:                 at http://localhost:7357/node_modules/mocha/mocha.js:4494:5
[14:11:45]:                 at timeslice (http://localhost:7357/node_modules/mocha/mocha.js:5487:27)
[14:11:45]:     ...
[14:11:45]: not ok 14 Chrome 28.0 - Auth0 parseHash should return error if iss is invalid
[14:11:45]:     ---
[14:11:45]:         message: >
[14:11:45]:             Auth0 is not defined
[14:11:45]:         stack: >
[14:11:45]:             ReferenceError: Auth0 is not defined
[14:11:45]:                 at Context.<anonymous> (http://localhost:7357/test/tests.js:171:19)
[14:11:45]:                 at Test.Runnable.run (http://localhost:7357/node_modules/mocha/mocha.js:4217:32)
[14:11:45]:                 at Runner.runTest (http://localhost:7357/node_modules/mocha/mocha.js:4591:10)
[14:11:45]:                 at http://localhost:7357/node_modules/mocha/mocha.js:4637:12
[14:11:45]:                 at next (http://localhost:7357/node_modules/mocha/mocha.js:4517:14)
[14:11:45]:                 at http://localhost:7357/node_modules/mocha/mocha.js:4526:7
[14:11:45]:                 at next (http://localhost:7357/node_modules/mocha/mocha.js:4470:23)
[14:11:45]:                 at http://localhost:7357/node_modules/mocha/mocha.js:4494:5
[14:11:45]:                 at timeslice (http://localhost:7357/node_modules/mocha/mocha.js:5487:27)
[14:11:45]:     ...
[14:11:45]: not ok 15 Chrome 28.0 - Auth0 parseHash should return an error if aud is invalid
[14:11:45]:     ---
[14:11:45]:         message: >
[14:11:45]:             Auth0 is not defined
[14:11:45]:         stack: >
[14:11:45]:             ReferenceError: Auth0 is not defined
[14:11:45]:                 at Context.<anonymous> (http://localhost:7357/test/tests.js:186:19)
[14:11:45]:                 at Test.Runnable.run (http://localhost:7357/node_modules/mocha/mocha.js:4217:32)
[14:11:45]:                 at Runner.runTest (http://localhost:7357/node_modules/mocha/mocha.js:4591:10)
[14:11:45]:                 at http://localhost:7357/node_modules/mocha/mocha.js:4637:12
[14:11:45]:                 at next (http://localhost:7357/node_modules/mocha/mocha.js:4517:14)
[14:11:45]:                 at http://localhost:7357/node_modules/mocha/mocha.js:4526:7
[14:11:45]:                 at next (http://localhost:7357/node_modules/mocha/mocha.js:4470:23)
[14:11:45]:                 at http://localhost:7357/node_modules/mocha/mocha.js:4494:5
[14:11:45]:                 at timeslice (http://localhost:7357/node_modules/mocha/mocha.js:5487:27)
[14:11:45]:     ...
[14:11:45]: not ok 16 Chrome 28.0 - Auth0 parseHash should be able to parse an error
[14:11:45]:     ---
[14:11:45]:         message: >
[14:11:45]:             Auth0 is not defined
[14:11:45]:         stack: >
[14:11:45]:             ReferenceError: Auth0 is not defined
[14:11:45]:                 at Context.<anonymous> (http://localhost:7357/test/tests.js:201:19)
[14:11:45]:                 at Test.Runnable.run (http://localhost:7357/node_modules/mocha/mocha.js:4217:32)
[14:11:45]:                 at Runner.runTest (http://localhost:7357/node_modules/mocha/mocha.js:4591:10)
[14:11:45]:                 at http://localhost:7357/node_modules/mocha/mocha.js:4637:12
[14:11:45]:                 at next (http://localhost:7357/node_modules/mocha/mocha.js:4517:14)
[14:11:45]:                 at http://localhost:7357/node_modules/mocha/mocha.js:4526:7
[14:11:45]:                 at next (http://localhost:7357/node_modules/mocha/mocha.js:4470:23)
[14:11:45]:                 at http://localhost:7357/node_modules/mocha/mocha.js:4494:5
[14:11:45]:                 at timeslice (http://localhost:7357/node_modules/mocha/mocha.js:5487:27)
[14:11:45]:     ...
[14:11:45]: not ok 17 Chrome 28.0 - Auth0 parseHash should be able to parse an error (if it starts with a slash)
[14:11:45]:     ---
[14:11:45]:         message: >
[14:11:45]:             Auth0 is not defined
[14:11:45]:         stack: >
[14:11:45]:             ReferenceError: Auth0 is not defined
[14:11:45]:                 at Context.<anonymous> (http://localhost:7357/test/tests.js:216:19)
[14:11:45]:                 at Test.Runnable.run (http://localhost:7357/node_modules/mocha/mocha.js:4217:32)
[14:11:45]:                 at Runner.runTest (http://localhost:7357/node_modules/mocha/mocha.js:4591:10)
[14:11:45]:                 at http://localhost:7357/node_modules/mocha/mocha.js:4637:12
[14:11:45]:                 at next (http://localhost:7357/node_modules/mocha/mocha.js:4517:14)
[14:11:45]:                 at http://localhost:7357/node_modules/mocha/mocha.js:4526:7
[14:11:45]:                 at next (http://localhost:7357/node_modules/mocha/mocha.js:4470:23)
[14:11:45]:                 at http://localhost:7357/node_modules/mocha/mocha.js:4494:5
[14:11:45]:                 at timeslice (http://localhost:7357/node_modules/mocha/mocha.js:5487:27)
[14:11:45]:     ...
[14:11:45]: not ok 18 Chrome 28.0 - Auth0 parseHash should return null if the hash URL doesn't contain access_token/error
[14:11:45]:     ---
[14:11:45]:         message: >
[14:11:45]:             Auth0 is not defined
[14:11:45]:         stack: >
[14:11:45]:             ReferenceError: Auth0 is not defined
[14:11:45]:                 at Context.<anonymous> (http://localhost:7357/test/tests.js:237:19)
[14:11:45]:                 at Test.Runnable.run (http://localhost:7357/node_modules/mocha/mocha.js:4217:32)
[14:11:45]:                 at Runner.runTest (http://localhost:7357/node_modules/mocha/mocha.js:4591:10)
[14:11:45]:                 at http://localhost:7357/node_modules/mocha/mocha.js:4637:12
[14:11:45]:                 at next (http://localhost:7357/node_modules/mocha/mocha.js:4517:14)
[14:11:45]:                 at http://localhost:7357/node_modules/mocha/mocha.js:4526:7
[14:11:45]:                 at next (http://localhost:7357/node_modules/mocha/mocha.js:4470:23)
[14:11:45]:                 at http://localhost:7357/node_modules/mocha/mocha.js:4494:5
[14:11:45]:                 at timeslice (http://localhost:7357/node_modules/mocha/mocha.js:5487:27)
[14:11:45]:     ...
[14:11:45]: not ok 19 Chrome 28.0 - Auth0 getProfile when called with an object should call the callback with error
[14:11:45]:     ---
[14:11:45]:         message: >
[14:11:45]:             Auth0 is not defined
[14:11:45]:         stack: >
[14:11:45]:             ReferenceError: Auth0 is not defined
[14:11:45]:                 at Context.<anonymous> (http://localhost:7357/test/tests.js:253:21)
[14:11:45]:                 at Test.Runnable.run (http://localhost:7357/node_modules/mocha/mocha.js:4200:15)
[14:11:45]:                 at Runner.runTest (http://localhost:7357/node_modules/mocha/mocha.js:4591:10)
[14:11:45]:                 at http://localhost:7357/node_modules/mocha/mocha.js:4637:12
[14:11:45]:                 at next (http://localhost:7357/node_modules/mocha/mocha.js:4517:14)
[14:11:45]:                 at http://localhost:7357/node_modules/mocha/mocha.js:4526:7
[14:11:45]:                 at next (http://localhost:7357/node_modules/mocha/mocha.js:4470:23)
[14:11:45]:                 at http://localhost:7357/node_modules/mocha/mocha.js:4494:5
[14:11:45]:                 at timeslice (http://localhost:7357/node_modules/mocha/mocha.js:5487:27)
[14:11:45]:     ...
[14:11:45]: not ok 20 Chrome 28.0 - Auth0 getProfile when called with an null should call the callback with error
[14:11:45]:     ---
[14:11:45]:         message: >
[14:11:45]:             Auth0 is not defined
[14:11:45]:         stack: >
[14:11:45]:             ReferenceError: Auth0 is not defined
[14:11:45]:                 at Context.<anonymous> (http://localhost:7357/test/tests.js:268:21)
[14:11:45]:                 at Test.Runnable.run (http://localhost:7357/node_modules/mocha/mocha.js:4200:15)
[14:11:45]:                 at Runner.runTest (http://localhost:7357/node_modules/mocha/mocha.js:4591:10)
[14:11:45]:                 at http://localhost:7357/node_modules/mocha/mocha.js:4637:12
[14:11:45]:                 at next (http://localhost:7357/node_modules/mocha/mocha.js:4517:14)
[14:11:45]:                 at http://localhost:7357/node_modules/mocha/mocha.js:4526:7
[14:11:45]:                 at next (http://localhost:7357/node_modules/mocha/mocha.js:4470:23)
[14:11:45]:                 at http://localhost:7357/node_modules/mocha/mocha.js:4494:5
[14:11:45]:                 at timeslice (http://localhost:7357/node_modules/mocha/mocha.js:5487:27)
[14:11:45]:     ...
[14:11:45]: not ok 21 Chrome 28.0 - Auth0 getProfile from token should be able to decode the id_token (if scope=openid profile)
[14:11:45]:     ---
[14:11:45]:         message: >
[14:11:45]:             Auth0 is not defined
[14:11:45]:         stack: >
[14:11:45]:             ReferenceError: Auth0 is not defined
[14:11:45]:                 at Context.<anonymous> (http://localhost:7357/test/tests.js:284:21)
[14:11:45]:                 at Test.Runnable.run (http://localhost:7357/node_modules/mocha/mocha.js:4200:15)
[14:11:45]:                 at Runner.runTest (http://localhost:7357/node_modules/mocha/mocha.js:4591:10)
[14:11:45]:                 at http://localhost:7357/node_modules/mocha/mocha.js:4637:12
[14:11:45]:                 at next (http://localhost:7357/node_modules/mocha/mocha.js:4517:14)
[14:11:45]:                 at http://localhost:7357/node_modules/mocha/mocha.js:4526:7
[14:11:45]:                 at next (http://localhost:7357/node_modules/mocha/mocha.js:4470:23)
[14:11:45]:                 at http://localhost:7357/node_modules/mocha/mocha.js:4494:5
[14:11:45]:                 at timeslice (http://localhost:7357/node_modules/mocha/mocha.js:5487:27)
[14:11:45]:     ...
[14:11:45]: not ok 22 Chrome 28.0 - Auth0 getProfile from token should be able to take the id_token (scope=openid) and call getUserInfo
[14:11:45]:     ---
[14:11:45]:         message: >
[14:11:45]:             Auth0 is not defined
[14:11:45]:         stack: >
[14:11:45]:             ReferenceError: Auth0 is not defined
[14:11:45]:                 at Context.<anonymous> (http://localhost:7357/test/tests.js:304:21)
[14:11:45]:                 at Test.Runnable.run (http://localhost:7357/node_modules/mocha/mocha.js:4200:15)
[14:11:45]:                 at Runner.runTest (http://localhost:7357/node_modules/mocha/mocha.js:4591:10)
[14:11:45]:                 at http://localhost:7357/node_modules/mocha/mocha.js:4637:12
[14:11:45]:                 at next (http://localhost:7357/node_modules/mocha/mocha.js:4517:14)
[14:11:45]:                 at http://localhost:7357/node_modules/mocha/mocha.js:4526:7
[14:11:45]:                 at next (http://localhost:7357/node_modules/mocha/mocha.js:4470:23)
[14:11:45]:                 at http://localhost:7357/node_modules/mocha/mocha.js:4494:5
[14:11:45]:                 at timeslice (http://localhost:7357/node_modules/mocha/mocha.js:5487:27)
[14:11:45]:     ...
[14:11:45]: not ok 23 Chrome 28.0 - Auth0 getDelegationToken Auth0 - User And Passwords logout should redirect to the logout url
[14:11:45]:     ---
[14:11:45]:         message: >
[14:11:45]:             Auth0 is not defined
[14:11:45]:         stack: >
[14:11:45]:             ReferenceError: Auth0 is not defined
[14:11:45]:                 at Context.<anonymous> (http://localhost:7357/test/logout.js:3:17)
[14:11:45]:                 at Test.Runnable.run (http://localhost:7357/node_modules/mocha/mocha.js:4200:15)
[14:11:45]:                 at Runner.runTest (http://localhost:7357/node_modules/mocha/mocha.js:4591:10)
[14:11:45]:                 at http://localhost:7357/node_modules/mocha/mocha.js:4637:12
[14:11:45]:                 at next (http://localhost:7357/node_modules/mocha/mocha.js:4517:14)
[14:11:45]:                 at http://localhost:7357/node_modules/mocha/mocha.js:4526:7
[14:11:45]:                 at next (http://localhost:7357/node_modules/mocha/mocha.js:4470:23)
[14:11:45]:                 at http://localhost:7357/node_modules/mocha/mocha.js:4494:5
[14:11:45]:                 at timeslice (http://localhost:7357/node_modules/mocha/mocha.js:5487:27)
[14:11:45]:     ...
[14:11:45]: not ok 24 Chrome 28.0 - Auth0 getDelegationToken Auth0 - User And Passwords logout should redirect to the logout url with params
[14:11:45]:     ---
[14:11:45]:         message: >
[14:11:45]:             Auth0 is not defined
[14:11:45]:         stack: >
[14:11:45]:             ReferenceError: Auth0 is not defined
[14:11:45]:                 at Context.<anonymous> (http://localhost:7357/test/logout.js:18:17)
[14:11:45]:                 at Test.Runnable.run (http://localhost:7357/node_modules/mocha/mocha.js:4200:15)
[14:11:45]:                 at Runner.runTest (http://localhost:7357/node_modules/mocha/mocha.js:4591:10)
[14:11:45]:                 at http://localhost:7357/node_modules/mocha/mocha.js:4637:12
[14:11:45]:                 at next (http://localhost:7357/node_modules/mocha/mocha.js:4517:14)
[14:11:45]:                 at http://localhost:7357/node_modules/mocha/mocha.js:4526:7
[14:11:45]:                 at next (http://localhost:7357/node_modules/mocha/mocha.js:4470:23)
[14:11:45]:                 at http://localhost:7357/node_modules/mocha/mocha.js:4494:5
[14:11:45]:                 at timeslice (http://localhost:7357/node_modules/mocha/mocha.js:5487:27)
[14:11:45]:     ...
[14:11:59]: not ok 25 Firefox 22.0 - Auth0 should fail to construct without a clientID
[14:11:59]:     ---
[14:11:59]:         message: >
[14:11:59]:             expected 'Auth0 is not defined' to match /clientID is required/
[14:11:59]:         stack: >
[14:11:59]:             Assertion.prototype.assert@http://localhost:7357/node_modules/expect.js/expect.js:99
[14:11:59]:             Assertion.prototype.match@http://localhost:7357/node_modules/expect.js/expect.js:313
[14:11:59]:             Assertion.prototype.throwException@http://localhost:7357/node_modules/expect.js/expect.js:142
[14:11:59]:             @http://localhost:7357/test/tests.js:10
[14:11:59]:             Runnable.prototype.run@http://localhost:7357/node_modules/mocha/mocha.js:4217
[14:11:59]:             Runner.prototype.runTest@http://localhost:7357/node_modules/mocha/mocha.js:4591
[14:11:59]:             Runner.prototype.runTests/next/<@http://localhost:7357/node_modules/mocha/mocha.js:4637
[14:11:59]:             next@http://localhost:7357/node_modules/mocha/mocha.js:4517
[14:11:59]:             Runner.prototype.hooks/next/<@http://localhost:7357/node_modules/mocha/mocha.js:4526
[14:11:59]:             next@http://localhost:7357/node_modules/mocha/mocha.js:4470
[14:11:59]:             Runner.prototype.hook/<@http://localhost:7357/node_modules/mocha/mocha.js:4494
[14:11:59]:             timeslice@http://localhost:7357/node_modules/mocha/mocha.js:5487
[14:11:59]:             
[14:11:59]:     ...
[14:11:59]: not ok 26 Firefox 22.0 - Auth0 should fail to construct without a callbackURL
[14:11:59]:     ---
[14:11:59]:         message: >
[14:11:59]:             expected 'Auth0 is not defined' to match /callbackURL is required/
[14:11:59]:         stack: >
[14:11:59]:             Assertion.prototype.assert@http://localhost:7357/node_modules/expect.js/expect.js:99
[14:11:59]:             Assertion.prototype.match@http://localhost:7357/node_modules/expect.js/expect.js:313
[14:11:59]:             Assertion.prototype.throwException@http://localhost:7357/node_modules/expect.js/expect.js:142
[14:11:59]:             @http://localhost:7357/test/tests.js:16
[14:11:59]:             Runnable.prototype.run@http://localhost:7357/node_modules/mocha/mocha.js:4217
[14:11:59]:             Runner.prototype.runTest@http://localhost:7357/node_modules/mocha/mocha.js:4591
[14:11:59]:             Runner.prototype.runTests/next/<@http://localhost:7357/node_modules/mocha/mocha.js:4637
[14:11:59]:             next@http://localhost:7357/node_modules/mocha/mocha.js:4517
[14:11:59]:             Runner.prototype.hooks/next/<@http://localhost:7357/node_modules/mocha/mocha.js:4526
[14:11:59]:             next@http://localhost:7357/node_modules/mocha/mocha.js:4470
[14:11:59]:             Runner.prototype.hook/<@http://localhost:7357/node_modules/mocha/mocha.js:4494
[14:11:59]:             timeslice@http://localhost:7357/node_modules/mocha/mocha.js:5487
[14:11:59]:             
[14:11:59]:     ...
[14:11:59]: not ok 27 Firefox 22.0 - Auth0 should fail to construct without a domain
[14:11:59]:     ---
[14:11:59]:         message: >
[14:11:59]:             expected 'Auth0 is not defined' to match /domain is required/
[14:11:59]:         stack: >
[14:11:59]:             Assertion.prototype.assert@http://localhost:7357/node_modules/expect.js/expect.js:99
[14:11:59]:             Assertion.prototype.match@http://localhost:7357/node_modules/expect.js/expect.js:313
[14:11:59]:             Assertion.prototype.throwException@http://localhost:7357/node_modules/expect.js/expect.js:142
[14:11:59]:             @http://localhost:7357/test/tests.js:22
[14:11:59]:             Runnable.prototype.run@http://localhost:7357/node_modules/mocha/mocha.js:4217
[14:11:59]:             Runner.prototype.runTest@http://localhost:7357/node_modules/mocha/mocha.js:4591
[14:11:59]:             Runner.prototype.runTests/next/<@http://localhost:7357/node_modules/mocha/mocha.js:4637
[14:11:59]:             next@http://localhost:7357/node_modules/mocha/mocha.js:4517
[14:11:59]:             Runner.prototype.hooks/next/<@http://localhost:7357/node_modules/mocha/mocha.js:4526
[14:11:59]:             next@http://localhost:7357/node_modules/mocha/mocha.js:4470
[14:11:59]:             Runner.prototype.hook/<@http://localhost:7357/node_modules/mocha/mocha.js:4494
[14:11:59]:             timeslice@http://localhost:7357/node_modules/mocha/mocha.js:5487
[14:11:59]:             
[14:11:59]:     ...
[14:11:59]: not ok 28 Firefox 22.0 - Auth0 should force constructor
[14:11:59]:     ---
[14:11:59]:         message: >
[14:11:59]:             Auth0 is not defined
[14:11:59]:         stack: >
[14:11:59]:             @http://localhost:7357/test/tests.js:26
[14:11:59]:             Runnable.prototype.run@http://localhost:7357/node_modules/mocha/mocha.js:4217
[14:11:59]:             Runner.prototype.runTest@http://localhost:7357/node_modules/mocha/mocha.js:4591
[14:11:59]:             Runner.prototype.runTests/next/<@http://localhost:7357/node_modules/mocha/mocha.js:4637
[14:11:59]:             next@http://localhost:7357/node_modules/mocha/mocha.js:4517
[14:11:59]:             Runner.prototype.hooks/next/<@http://localhost:7357/node_modules/mocha/mocha.js:4526
[14:11:59]:             next@http://localhost:7357/node_modules/mocha/mocha.js:4470
[14:11:59]:             Runner.prototype.hook/<@http://localhost:7357/node_modules/mocha/mocha.js:4494
[14:11:59]:             timeslice@http://localhost:7357/node_modules/mocha/mocha.js:5487
[14:11:59]:             
[14:11:59]:     ...
[14:11:59]: not ok 29 Firefox 22.0 - Auth0 should redirect to /authorize with google (callbackOnLocationHash: on)
[14:11:59]:     ---
[14:11:59]:         message: >
[14:11:59]:             Auth0 is not defined
[14:11:59]:         stack: >
[14:11:59]:             @http://localhost:7357/test/tests.js:38
[14:11:59]:             Runnable.prototype.run@http://localhost:7357/node_modules/mocha/mocha.js:4200
[14:11:59]:             Runner.prototype.runTest@http://localhost:7357/node_modules/mocha/mocha.js:4591
[14:11:59]:             Runner.prototype.runTests/next/<@http://localhost:7357/node_modules/mocha/mocha.js:4637
[14:11:59]:             next@http://localhost:7357/node_modules/mocha/mocha.js:4517
[14:11:59]:             Runner.prototype.hooks/next/<@http://localhost:7357/node_modules/mocha/mocha.js:4526
[14:11:59]:             next@http://localhost:7357/node_modules/mocha/mocha.js:4470
[14:11:59]:             Runner.prototype.hook/<@http://localhost:7357/node_modules/mocha/mocha.js:4494
[14:11:59]:             timeslice@http://localhost:7357/node_modules/mocha/mocha.js:5487
[14:11:59]:             
[14:11:59]:     ...
[14:11:59]: not ok 30 Firefox 22.0 - Auth0 should fail if auth0.login is called with {popup: true} and without callback
[14:11:59]:     ---
[14:11:59]:         message: >
[14:11:59]:             Auth0 is not defined
[14:11:59]:         stack: >
[14:11:59]:             @http://localhost:7357/test/tests.js:68
[14:11:59]:             Runnable.prototype.run@http://localhost:7357/node_modules/mocha/mocha.js:4217
[14:11:59]:             Runner.prototype.runTest@http://localhost:7357/node_modules/mocha/mocha.js:4591
[14:11:59]:             Runner.prototype.runTests/next/<@http://localhost:7357/node_modules/mocha/mocha.js:4637
[14:11:59]:             next@http://localhost:7357/node_modules/mocha/mocha.js:4517
[14:11:59]:             Runner.prototype.hooks/next/<@http://localhost:7357/node_modules/mocha/mocha.js:4526
[14:11:59]:             next@http://localhost:7357/node_modules/mocha/mocha.js:4470
[14:11:59]:             Runner.prototype.hook/<@http://localhost:7357/node_modules/mocha/mocha.js:4494
[14:11:59]:             timeslice@http://localhost:7357/node_modules/mocha/mocha.js:5487
[14:11:59]:             
[14:11:59]:     ...
[14:11:59]: not ok 31 Firefox 22.0 - Auth0 should fail if auth0.loginWithPopup is called without callback
[14:11:59]:     ---
[14:11:59]:         message: >
[14:11:59]:             Auth0 is not defined
[14:11:59]:         stack: >
[14:11:59]:             @http://localhost:7357/test/tests.js:81
[14:11:59]:             Runnable.prototype.run@http://localhost:7357/node_modules/mocha/mocha.js:4217
[14:11:59]:             Runner.prototype.runTest@http://localhost:7357/node_modules/mocha/mocha.js:4591
[14:11:59]:             Runner.prototype.runTests/next/<@http://localhost:7357/node_modules/mocha/mocha.js:4637
[14:11:59]:             next@http://localhost:7357/node_modules/mocha/mocha.js:4517
[14:11:59]:             Runner.prototype.hooks/next/<@http://localhost:7357/node_modules/mocha/mocha.js:4526
[14:11:59]:             next@http://localhost:7357/node_modules/mocha/mocha.js:4470
[14:11:59]:             Runner.prototype.hook/<@http://localhost:7357/node_modules/mocha/mocha.js:4494
[14:11:59]:             timeslice@http://localhost:7357/node_modules/mocha/mocha.js:5487
[14:11:59]:             
[14:11:59]:     ...
[14:11:59]: not ok 32 Firefox 22.0 - Auth0 should support to use signin as an alias for login
[14:11:59]:     ---
[14:11:59]:         message: >
[14:11:59]:             Auth0 is not defined
[14:11:59]:         stack: >
[14:11:59]:             @http://localhost:7357/test/tests.js:95
[14:11:59]:             Runnable.prototype.run@http://localhost:7357/node_modules/mocha/mocha.js:4217
[14:11:59]:             Runner.prototype.runTest@http://localhost:7357/node_modules/mocha/mocha.js:4591
[14:11:59]:             Runner.prototype.runTests/next/<@http://localhost:7357/node_modules/mocha/mocha.js:4637
[14:11:59]:             next@http://localhost:7357/node_modules/mocha/mocha.js:4517
[14:11:59]:             Runner.prototype.hooks/next/<@http://localhost:7357/node_modules/mocha/mocha.js:4526
[14:11:59]:             next@http://localhost:7357/node_modules/mocha/mocha.js:4470
[14:11:59]:             Runner.prototype.hook/<@http://localhost:7357/node_modules/mocha/mocha.js:4494
[14:11:59]:             timeslice@http://localhost:7357/node_modules/mocha/mocha.js:5487
[14:11:59]:             
[14:11:59]:     ...
[14:11:59]: not ok 33 Firefox 22.0 - Auth0 should redirect to /authorize with google (callbackOnLocationHash: off)
[14:11:59]:     ---
[14:11:59]:         message: >
[14:11:59]:             Auth0 is not defined
[14:11:59]:         stack: >
[14:11:59]:             @http://localhost:7357/test/tests.js:106
[14:11:59]:             Runnable.prototype.run@http://localhost:7357/node_modules/mocha/mocha.js:4200
[14:11:59]:             Runner.prototype.runTest@http://localhost:7357/node_modules/mocha/mocha.js:4591
[14:11:59]:             Runner.prototype.runTests/next/<@http://localhost:7357/node_modules/mocha/mocha.js:4637
[14:11:59]:             next@http://localhost:7357/node_modules/mocha/mocha.js:4517
[14:11:59]:             Runner.prototype.hooks/next/<@http://localhost:7357/node_modules/mocha/mocha.js:4526
[14:11:59]:             next@http://localhost:7357/node_modules/mocha/mocha.js:4470
[14:11:59]:             Runner.prototype.hook/<@http://localhost:7357/node_modules/mocha/mocha.js:4494
[14:11:59]:             timeslice@http://localhost:7357/node_modules/mocha/mocha.js:5487
[14:11:59]:             
[14:11:59]:     ...
[14:11:59]: not ok 34 Firefox 22.0 - Auth0 should return SSO data
[14:11:59]:     ---
[14:11:59]:         message: >
[14:11:59]:             Auth0 is not defined
[14:11:59]:         stack: >
[14:11:59]:             @http://localhost:7357/test/tests.js:327
[14:11:59]:             Runnable.prototype.run@http://localhost:7357/node_modules/mocha/mocha.js:4200
[14:11:59]:             Runner.prototype.runTest@http://localhost:7357/node_modules/mocha/mocha.js:4591
[14:11:59]:             Runner.prototype.runTests/next/<@http://localhost:7357/node_modules/mocha/mocha.js:4637
[14:11:59]:             next@http://localhost:7357/node_modules/mocha/mocha.js:4517
[14:11:59]:             Runner.prototype.hooks/next/<@http://localhost:7357/node_modules/mocha/mocha.js:4526
[14:11:59]:             next@http://localhost:7357/node_modules/mocha/mocha.js:4470
[14:11:59]:             Runner.prototype.hook/<@http://localhost:7357/node_modules/mocha/mocha.js:4494
[14:11:59]:             timeslice@http://localhost:7357/node_modules/mocha/mocha.js:5487
[14:11:59]:             
[14:11:59]:     ...
[14:11:59]: not ok 35 Firefox 22.0 - Auth0 should return configured connections
[14:11:59]:     ---
[14:11:59]:         message: >
[14:11:59]:             Auth0 is not defined
[14:11:59]:         stack: >
[14:11:59]:             @http://localhost:7357/test/tests.js:340
[14:11:59]:             Runnable.prototype.run@http://localhost:7357/node_modules/mocha/mocha.js:4200
[14:11:59]:             Runner.prototype.runTest@http://localhost:7357/node_modules/mocha/mocha.js:4591
[14:11:59]:             Runner.prototype.runTests/next/<@http://localhost:7357/node_modules/mocha/mocha.js:4637
[14:11:59]:             next@http://localhost:7357/node_modules/mocha/mocha.js:4517
[14:11:59]:             Runner.prototype.hooks/next/<@http://localhost:7357/node_modules/mocha/mocha.js:4526
[14:11:59]:             next@http://localhost:7357/node_modules/mocha/mocha.js:4470
[14:11:59]:             Runner.prototype.hook/<@http://localhost:7357/node_modules/mocha/mocha.js:4494
[14:11:59]:             timeslice@http://localhost:7357/node_modules/mocha/mocha.js:5487
[14:11:59]:             
[14:11:59]:     ...
[14:11:59]: not ok 36 Firefox 22.0 - Auth0 parseHash should be able to parse the profile
[14:11:59]:     ---
[14:11:59]:         message: >
[14:11:59]:             Auth0 is not defined
[14:11:59]:         stack: >
[14:11:59]:             @http://localhost:7357/test/tests.js:139
[14:11:59]:             Runnable.prototype.run@http://localhost:7357/node_modules/mocha/mocha.js:4217
[14:11:59]:             Runner.prototype.runTest@http://localhost:7357/node_modules/mocha/mocha.js:4591
[14:11:59]:             Runner.prototype.runTests/next/<@http://localhost:7357/node_modules/mocha/mocha.js:4637
[14:11:59]:             next@http://localhost:7357/node_modules/mocha/mocha.js:4517
[14:11:59]:             Runner.prototype.hooks/next/<@http://localhost:7357/node_modules/mocha/mocha.js:4526
[14:11:59]:             next@http://localhost:7357/node_modules/mocha/mocha.js:4470
[14:11:59]:             Runner.prototype.hook/<@http://localhost:7357/node_modules/mocha/mocha.js:4494
[14:11:59]:             timeslice@http://localhost:7357/node_modules/mocha/mocha.js:5487
[14:11:59]:             
[14:11:59]:     ...
[14:11:59]: not ok 37 Firefox 22.0 - Auth0 parseHash should be able to parse the profile (if it starts with a slash)
[14:11:59]:     ---
[14:11:59]:         message: >
[14:11:59]:             Auth0 is not defined
[14:11:59]:         stack: >
[14:11:59]:             @http://localhost:7357/test/tests.js:155
[14:11:59]:             Runnable.prototype.run@http://localhost:7357/node_modules/mocha/mocha.js:4217
[14:11:59]:             Runner.prototype.runTest@http://localhost:7357/node_modules/mocha/mocha.js:4591
[14:11:59]:             Runner.prototype.runTests/next/<@http://localhost:7357/node_modules/mocha/mocha.js:4637
[14:11:59]:             next@http://localhost:7357/node_modules/mocha/mocha.js:4517
[14:11:59]:             Runner.prototype.hooks/next/<@http://localhost:7357/node_modules/mocha/mocha.js:4526
[14:11:59]:             next@http://localhost:7357/node_modules/mocha/mocha.js:4470
[14:11:59]:             Runner.prototype.hook/<@http://localhost:7357/node_modules/mocha/mocha.js:4494
[14:11:59]:             timeslice@http://localhost:7357/node_modules/mocha/mocha.js:5487
[14:11:59]:             
[14:11:59]:     ...
[14:11:59]: not ok 38 Firefox 22.0 - Auth0 parseHash should return error if iss is invalid
[14:11:59]:     ---
[14:11:59]:         message: >
[14:11:59]:             Auth0 is not defined
[14:11:59]:         stack: >
[14:11:59]:             @http://localhost:7357/test/tests.js:171
[14:11:59]:             Runnable.prototype.run@http://localhost:7357/node_modules/mocha/mocha.js:4217
[14:11:59]:             Runner.prototype.runTest@http://localhost:7357/node_modules/mocha/mocha.js:4591
[14:11:59]:             Runner.prototype.runTests/next/<@http://localhost:7357/node_modules/mocha/mocha.js:4637
[14:11:59]:             next@http://localhost:7357/node_modules/mocha/mocha.js:4517
[14:11:59]:             Runner.prototype.hooks/next/<@http://localhost:7357/node_modules/mocha/mocha.js:4526
[14:11:59]:             next@http://localhost:7357/node_modules/mocha/mocha.js:4470
[14:11:59]:             Runner.prototype.hook/<@http://localhost:7357/node_modules/mocha/mocha.js:4494
[14:11:59]:             timeslice@http://localhost:7357/node_modules/mocha/mocha.js:5487
[14:11:59]:             
[14:11:59]:     ...
[14:11:59]: not ok 39 Firefox 22.0 - Auth0 parseHash should return an error if aud is invalid
[14:11:59]:     ---
[14:11:59]:         message: >
[14:11:59]:             Auth0 is not defined
[14:11:59]:         stack: >
[14:11:59]:             @http://localhost:7357/test/tests.js:186
[14:11:59]:             Runnable.prototype.run@http://localhost:7357/node_modules/mocha/mocha.js:4217
[14:11:59]:             Runner.prototype.runTest@http://localhost:7357/node_modules/mocha/mocha.js:4591
[14:11:59]:             Runner.prototype.runTests/next/<@http://localhost:7357/node_modules/mocha/mocha.js:4637
[14:11:59]:             next@http://localhost:7357/node_modules/mocha/mocha.js:4517
[14:11:59]:             Runner.prototype.hooks/next/<@http://localhost:7357/node_modules/mocha/mocha.js:4526
[14:11:59]:             next@http://localhost:7357/node_modules/mocha/mocha.js:4470
[14:11:59]:             Runner.prototype.hook/<@http://localhost:7357/node_modules/mocha/mocha.js:4494
[14:11:59]:             timeslice@http://localhost:7357/node_modules/mocha/mocha.js:5487
[14:11:59]:             
[14:11:59]:     ...
[14:11:59]: not ok 40 Firefox 22.0 - Auth0 parseHash should be able to parse an error
[14:11:59]:     ---
[14:11:59]:         message: >
[14:11:59]:             Auth0 is not defined
[14:11:59]:         stack: >
[14:11:59]:             @http://localhost:7357/test/tests.js:201
[14:11:59]:             Runnable.prototype.run@http://localhost:7357/node_modules/mocha/mocha.js:4217
[14:11:59]:             Runner.prototype.runTest@http://localhost:7357/node_modules/mocha/mocha.js:4591
[14:11:59]:             Runner.prototype.runTests/next/<@http://localhost:7357/node_modules/mocha/mocha.js:4637
[14:11:59]:             next@http://localhost:7357/node_modules/mocha/mocha.js:4517
[14:11:59]:             Runner.prototype.hooks/next/<@http://localhost:7357/node_modules/mocha/mocha.js:4526
[14:11:59]:             next@http://localhost:7357/node_modules/mocha/mocha.js:4470
[14:11:59]:             Runner.prototype.hook/<@http://localhost:7357/node_modules/mocha/mocha.js:4494
[14:11:59]:             timeslice@http://localhost:7357/node_modules/mocha/mocha.js:5487
[14:11:59]:             
[14:11:59]:     ...
[14:11:59]: not ok 41 Firefox 22.0 - Auth0 parseHash should be able to parse an error (if it starts with a slash)
[14:11:59]:     ---
[14:11:59]:         message: >
[14:11:59]:             Auth0 is not defined
[14:11:59]:         stack: >
[14:11:59]:             @http://localhost:7357/test/tests.js:216
[14:11:59]:             Runnable.prototype.run@http://localhost:7357/node_modules/mocha/mocha.js:4217
[14:11:59]:             Runner.prototype.runTest@http://localhost:7357/node_modules/mocha/mocha.js:4591
[14:11:59]:             Runner.prototype.runTests/next/<@http://localhost:7357/node_modules/mocha/mocha.js:4637
[14:11:59]:             next@http://localhost:7357/node_modules/mocha/mocha.js:4517
[14:11:59]:             Runner.prototype.hooks/next/<@http://localhost:7357/node_modules/mocha/mocha.js:4526
[14:11:59]:             next@http://localhost:7357/node_modules/mocha/mocha.js:4470
[14:11:59]:             Runner.prototype.hook/<@http://localhost:7357/node_modules/mocha/mocha.js:4494
[14:11:59]:             timeslice@http://localhost:7357/node_modules/mocha/mocha.js:5487
[14:11:59]:             
[14:11:59]:     ...
[14:11:59]: not ok 42 Firefox 22.0 - Auth0 parseHash should return null if the hash URL doesn't contain access_token/error
[14:11:59]:     ---
[14:11:59]:         message: >
[14:11:59]:             Auth0 is not defined
[14:11:59]:         stack: >
[14:11:59]:             @http://localhost:7357/test/tests.js:237
[14:11:59]:             Runnable.prototype.run@http://localhost:7357/node_modules/mocha/mocha.js:4217
[14:11:59]:             Runner.prototype.runTest@http://localhost:7357/node_modules/mocha/mocha.js:4591
[14:11:59]:             Runner.prototype.runTests/next/<@http://localhost:7357/node_modules/mocha/mocha.js:4637
[14:11:59]:             next@http://localhost:7357/node_modules/mocha/mocha.js:4517
[14:11:59]:             Runner.prototype.hooks/next/<@http://localhost:7357/node_modules/mocha/mocha.js:4526
[14:11:59]:             next@http://localhost:7357/node_modules/mocha/mocha.js:4470
[14:11:59]:             Runner.prototype.hook/<@http://localhost:7357/node_modules/mocha/mocha.js:4494
[14:11:59]:             timeslice@http://localhost:7357/node_modules/mocha/mocha.js:5487
[14:11:59]:             
[14:11:59]:     ...
[14:11:59]: not ok 43 Firefox 22.0 - Auth0 getProfile when called with an object should call the callback with error
[14:11:59]:     ---
[14:11:59]:         message: >
[14:11:59]:             Auth0 is not defined
[14:11:59]:         stack: >
[14:11:59]:             @http://localhost:7357/test/tests.js:253
[14:11:59]:             Runnable.prototype.run@http://localhost:7357/node_modules/mocha/mocha.js:4200
[14:11:59]:             Runner.prototype.runTest@http://localhost:7357/node_modules/mocha/mocha.js:4591
[14:11:59]:             Runner.prototype.runTests/next/<@http://localhost:7357/node_modules/mocha/mocha.js:4637
[14:11:59]:             next@http://localhost:7357/node_modules/mocha/mocha.js:4517
[14:11:59]:             Runner.prototype.hooks/next/<@http://localhost:7357/node_modules/mocha/mocha.js:4526
[14:11:59]:             next@http://localhost:7357/node_modules/mocha/mocha.js:4470
[14:11:59]:             Runner.prototype.hook/<@http://localhost:7357/node_modules/mocha/mocha.js:4494
[14:11:59]:             timeslice@http://localhost:7357/node_modules/mocha/mocha.js:5487
[14:11:59]:             
[14:11:59]:     ...
[14:11:59]: not ok 44 Firefox 22.0 - Auth0 getProfile when called with an null should call the callback with error
[14:11:59]:     ---
[14:11:59]:         message: >
[14:11:59]:             Auth0 is not defined
[14:11:59]:         stack: >
[14:11:59]:             @http://localhost:7357/test/tests.js:268
[14:11:59]:             Runnable.prototype.run@http://localhost:7357/node_modules/mocha/mocha.js:4200
[14:11:59]:             Runner.prototype.runTest@http://localhost:7357/node_modules/mocha/mocha.js:4591
[14:11:59]:             Runner.prototype.runTests/next/<@http://localhost:7357/node_modules/mocha/mocha.js:4637
[14:11:59]:             next@http://localhost:7357/node_modules/mocha/mocha.js:4517
[14:11:59]:             Runner.prototype.hooks/next/<@http://localhost:7357/node_modules/mocha/mocha.js:4526
[14:11:59]:             next@http://localhost:7357/node_modules/mocha/mocha.js:4470
[14:11:59]:             Runner.prototype.hook/<@http://localhost:7357/node_modules/mocha/mocha.js:4494
[14:11:59]:             timeslice@http://localhost:7357/node_modules/mocha/mocha.js:5487
[14:11:59]:             
[14:11:59]:     ...
[14:11:59]: not ok 45 Firefox 22.0 - Auth0 getProfile from token should be able to decode the id_token (if scope=openid profile)
[14:11:59]:     ---
[14:11:59]:         message: >
[14:11:59]:             Auth0 is not defined
[14:11:59]:         stack: >
[14:11:59]:             @http://localhost:7357/test/tests.js:284
[14:11:59]:             Runnable.prototype.run@http://localhost:7357/node_modules/mocha/mocha.js:4200
[14:11:59]:             Runner.prototype.runTest@http://localhost:7357/node_modules/mocha/mocha.js:4591
[14:11:59]:             Runner.prototype.runTests/next/<@http://localhost:7357/node_modules/mocha/mocha.js:4637
[14:11:59]:             next@http://localhost:7357/node_modules/mocha/mocha.js:4517
[14:11:59]:             Runner.prototype.hooks/next/<@http://localhost:7357/node_modules/mocha/mocha.js:4526
[14:11:59]:             next@http://localhost:7357/node_modules/mocha/mocha.js:4470
[14:11:59]:             Runner.prototype.hook/<@http://localhost:7357/node_modules/mocha/mocha.js:4494
[14:11:59]:             timeslice@http://localhost:7357/node_modules/mocha/mocha.js:5487
[14:11:59]:             
[14:11:59]:     ...
[14:11:59]: not ok 46 Firefox 22.0 - Auth0 getProfile from token should be able to take the id_token (scope=openid) and call getUserInfo
[14:11:59]:     ---
[14:11:59]:         message: >
[14:11:59]:             Auth0 is not defined
[14:11:59]:         stack: >
[14:11:59]:             @http://localhost:7357/test/tests.js:304
[14:11:59]:             Runnable.prototype.run@http://localhost:7357/node_modules/mocha/mocha.js:4200
[14:11:59]:             Runner.prototype.runTest@http://localhost:7357/node_modules/mocha/mocha.js:4591
[14:11:59]:             Runner.prototype.runTests/next/<@http://localhost:7357/node_modules/mocha/mocha.js:4637
[14:11:59]:             next@http://localhost:7357/node_modules/mocha/mocha.js:4517
[14:11:59]:             Runner.prototype.hooks/next/<@http://localhost:7357/node_modules/mocha/mocha.js:4526
[14:11:59]:             next@http://localhost:7357/node_modules/mocha/mocha.js:4470
[14:11:59]:             Runner.prototype.hook/<@http://localhost:7357/node_modules/mocha/mocha.js:4494
[14:11:59]:             timeslice@http://localhost:7357/node_modules/mocha/mocha.js:5487
[14:11:59]:             
[14:11:59]:     ...
[14:11:59]: not ok 47 Firefox 22.0 - Auth0 getDelegationToken Auth0 - User And Passwords logout should redirect to the logout url
[14:11:59]:     ---
[14:11:59]:         message: >
[14:11:59]:             Auth0 is not defined
[14:11:59]:         stack: >
[14:11:59]:             @http://localhost:7357/test/logout.js:3
[14:11:59]:             Runnable.prototype.run@http://localhost:7357/node_modules/mocha/mocha.js:4200
[14:11:59]:             Runner.prototype.runTest@http://localhost:7357/node_modules/mocha/mocha.js:4591
[14:11:59]:             Runner.prototype.runTests/next/<@http://localhost:7357/node_modules/mocha/mocha.js:4637
[14:11:59]:             next@http://localhost:7357/node_modules/mocha/mocha.js:4517
[14:11:59]:             Runner.prototype.hooks/next/<@http://localhost:7357/node_modules/mocha/mocha.js:4526
[14:11:59]:             next@http://localhost:7357/node_modules/mocha/mocha.js:4470
[14:11:59]:             Runner.prototype.hook/<@http://localhost:7357/node_modules/mocha/mocha.js:4494
[14:11:59]:             timeslice@http://localhost:7357/node_modules/mocha/mocha.js:5487
[14:11:59]:             
[14:11:59]:     ...
[14:11:59]: not ok 48 Firefox 22.0 - Auth0 getDelegationToken Auth0 - User And Passwords logout should redirect to the logout url with params
[14:11:59]:     ---
[14:11:59]:         message: >
[14:11:59]:             Auth0 is not defined
[14:11:59]:         stack: >
[14:11:59]:             @http://localhost:7357/test/logout.js:18
[14:11:59]:             Runnable.prototype.run@http://localhost:7357/node_modules/mocha/mocha.js:4200
[14:11:59]:             Runner.prototype.runTest@http://localhost:7357/node_modules/mocha/mocha.js:4591
[14:11:59]:             Runner.prototype.runTests/next/<@http://localhost:7357/node_modules/mocha/mocha.js:4637
[14:11:59]:             next@http://localhost:7357/node_modules/mocha/mocha.js:4517
[14:11:59]:             Runner.prototype.hooks/next/<@http://localhost:7357/node_modules/mocha/mocha.js:4526
[14:11:59]:             next@http://localhost:7357/node_modules/mocha/mocha.js:4470
[14:11:59]:             Runner.prototype.hook/<@http://localhost:7357/node_modules/mocha/mocha.js:4494
[14:11:59]:             timeslice@http://localhost:7357/node_modules/mocha/mocha.js:5487
[14:11:59]:             
[14:11:59]:     ...
[14:12:23]: not ok 49 IE 8.0 - Auth0 should fail to construct without a clientID
[14:12:23]:     ---
[14:12:23]:         message: >
[14:12:23]:             expected '\'Auth0\' is undefined' to match /clientID is required/
[14:12:23]:     ...
[14:12:23]: not ok 50 IE 8.0 - Auth0 should fail to construct without a callbackURL
[14:12:23]:     ---
[14:12:23]:         message: >
[14:12:23]:             expected '\'Auth0\' is undefined' to match /callbackURL is required/
[14:12:23]:     ...
[14:12:23]: not ok 51 IE 8.0 - Auth0 should fail to construct without a domain
[14:12:23]:     ---
[14:12:23]:         message: >
[14:12:23]:             expected '\'Auth0\' is undefined' to match /domain is required/
[14:12:23]:     ...
[14:12:23]: not ok 52 IE 8.0 - Auth0 should force constructor
[14:12:23]:     ---
[14:12:23]:         message: >
[14:12:23]:             Object expected
[14:12:23]:     ...
[14:12:23]: not ok 53 IE 8.0 - Auth0 should redirect to /authorize with google (callbackOnLocationHash: on)
[14:12:23]:     ---
[14:12:23]:         message: >
[14:12:23]:             Object expected
[14:12:23]:     ...
[14:12:23]: not ok 54 IE 8.0 - Auth0 should fail if auth0.login is called with {popup: true} and without callback
[14:12:23]:     ---
[14:12:23]:         message: >
[14:12:23]:             Object expected
[14:12:23]:     ...
[14:12:23]: not ok 55 IE 8.0 - Auth0 should fail if auth0.loginWithPopup is called without callback
[14:12:23]:     ---
[14:12:23]:         message: >
[14:12:23]:             Object expected
[14:12:23]:     ...
[14:12:23]: not ok 56 IE 8.0 - Auth0 should support to use signin as an alias for login
[14:12:23]:     ---
[14:12:23]:         message: >
[14:12:23]:             Object expected
[14:12:23]:     ...
[14:12:23]: not ok 57 IE 8.0 - Auth0 should redirect to /authorize with google (callbackOnLocationHash: off)
[14:12:23]:     ---
[14:12:23]:         message: >
[14:12:23]:             Object expected
[14:12:23]:     ...
[14:12:23]: not ok 58 IE 8.0 - Auth0 should return SSO data
[14:12:23]:     ---
[14:12:23]:         message: >
[14:12:23]:             Object expected
[14:12:23]:     ...
[14:12:23]: not ok 59 IE 8.0 - Auth0 should return configured connections
[14:12:23]:     ---
[14:12:23]:         message: >
[14:12:23]:             Object expected
[14:12:23]:     ...
[14:12:23]: not ok 60 IE 8.0 - Auth0 parseHash should be able to parse the profile
[14:12:23]:     ---
[14:12:23]:         message: >
[14:12:23]:             Object expected
[14:12:23]:     ...
[14:12:23]: not ok 61 IE 8.0 - Auth0 parseHash should be able to parse the profile (if it starts with a slash)
[14:12:23]:     ---
[14:12:23]:         message: >
[14:12:23]:             Object expected
[14:12:23]:     ...
[14:12:23]: not ok 62 IE 8.0 - Auth0 parseHash should return error if iss is invalid
[14:12:23]:     ---
[14:12:23]:         message: >
[14:12:23]:             Object expected
[14:12:23]:     ...
[14:12:23]: not ok 63 IE 8.0 - Auth0 parseHash should return an error if aud is invalid
[14:12:23]:     ---
[14:12:23]:         message: >
[14:12:23]:             Object expected
[14:12:23]:     ...
[14:12:23]: not ok 64 IE 8.0 - Auth0 parseHash should be able to parse an error
[14:12:23]:     ---
[14:12:23]:         message: >
[14:12:23]:             Object expected
[14:12:23]:     ...
[14:12:23]: not ok 65 IE 8.0 - Auth0 parseHash should be able to parse an error (if it starts with a slash)
[14:12:23]:     ---
[14:12:23]:         message: >
[14:12:23]:             Object expected
[14:12:23]:     ...
[14:12:23]: not ok 66 IE 8.0 - Auth0 parseHash should return null if the hash URL doesn't contain access_token/error
[14:12:23]:     ---
[14:12:23]:         message: >
[14:12:23]:             Object expected
[14:12:23]:     ...
[14:12:23]: not ok 67 IE 8.0 - Auth0 getProfile when called with an object should call the callback with error
[14:12:23]:     ---
[14:12:23]:         message: >
[14:12:23]:             Object expected
[14:12:23]:     ...
[14:12:23]: not ok 68 IE 8.0 - Auth0 getProfile when called with an null should call the callback with error
[14:12:23]:     ---
[14:12:23]:         message: >
[14:12:23]:             Object expected
[14:12:23]:     ...
[14:12:23]: not ok 69 IE 8.0 - Auth0 getProfile from token should be able to decode the id_token (if scope=openid profile)
[14:12:23]:     ---
[14:12:23]:         message: >
[14:12:23]:             Object expected
[14:12:23]:     ...
[14:12:23]: not ok 70 IE 8.0 - Auth0 getProfile from token should be able to take the id_token (scope=openid) and call getUserInfo
[14:12:23]:     ---
[14:12:23]:         message: >
[14:12:23]:             Object expected
[14:12:23]:     ...
[14:12:23]: not ok 71 IE 8.0 - Auth0 getDelegationToken Auth0 - User And Passwords logout should redirect to the logout url
[14:12:23]:     ---
[14:12:23]:         message: >
[14:12:23]:             Object expected
[14:12:23]:     ...
[14:12:23]: not ok 72 IE 8.0 - Auth0 getDelegationToken Auth0 - User And Passwords logout should redirect to the logout url with params
[14:12:23]:     ---
[14:12:23]:         message: >
[14:12:23]:             Object expected
[14:12:23]:     ...
[14:12:36]: not ok 73 IE 9.0 - Auth0 should fail to construct without a clientID
[14:12:36]:     ---
[14:12:36]:         message: >
[14:12:36]:             expected '\'Auth0\' is undefined' to match /clientID is required/
[14:12:36]:     ...
[14:12:36]: not ok 74 IE 9.0 - Auth0 should fail to construct without a callbackURL
[14:12:36]:     ---
[14:12:36]:         message: >
[14:12:36]:             expected '\'Auth0\' is undefined' to match /callbackURL is required/
[14:12:36]:     ...
[14:12:36]: not ok 75 IE 9.0 - Auth0 should fail to construct without a domain
[14:12:36]:     ---
[14:12:36]:         message: >
[14:12:36]:             expected '\'Auth0\' is undefined' to match /domain is required/
[14:12:36]:     ...
[14:12:36]: not ok 76 IE 9.0 - Auth0 should force constructor
[14:12:36]:     ---
[14:12:36]:         message: >
[14:12:36]:             The value of the property 'Auth0' is null or undefined, not a Function object
[14:12:36]:     ...
[14:12:36]: not ok 77 IE 9.0 - Auth0 should redirect to /authorize with google (callbackOnLocationHash: on)
[14:12:36]:     ---
[14:12:36]:         message: >
[14:12:36]:             The value of the property 'Auth0' is null or undefined, not a Function object
[14:12:36]:     ...
[14:12:36]: not ok 78 IE 9.0 - Auth0 should fail if auth0.login is called with {popup: true} and without callback
[14:12:36]:     ---
[14:12:36]:         message: >
[14:12:36]:             The value of the property 'Auth0' is null or undefined, not a Function object
[14:12:36]:     ...
[14:12:36]: not ok 79 IE 9.0 - Auth0 should fail if auth0.loginWithPopup is called without callback
[14:12:36]:     ---
[14:12:36]:         message: >
[14:12:36]:             The value of the property 'Auth0' is null or undefined, not a Function object
[14:12:36]:     ...
[14:12:36]: not ok 80 IE 9.0 - Auth0 should support to use signin as an alias for login
[14:12:36]:     ---
[14:12:36]:         message: >
[14:12:36]:             The value of the property 'Auth0' is null or undefined, not a Function object
[14:12:36]:     ...
[14:12:36]: not ok 81 IE 9.0 - Auth0 should redirect to /authorize with google (callbackOnLocationHash: off)
[14:12:36]:     ---
[14:12:36]:         message: >
[14:12:36]:             The value of the property 'Auth0' is null or undefined, not a Function object
[14:12:36]:     ...
[14:12:36]: not ok 82 IE 9.0 - Auth0 should return SSO data
[14:12:36]:     ---
[14:12:36]:         message: >
[14:12:36]:             The value of the property 'Auth0' is null or undefined, not a Function object
[14:12:36]:     ...
[14:12:36]: not ok 83 IE 9.0 - Auth0 should return configured connections
[14:12:36]:     ---
[14:12:36]:         message: >
[14:12:36]:             The value of the property 'Auth0' is null or undefined, not a Function object
[14:12:36]:     ...
[14:12:36]: not ok 84 IE 9.0 - Auth0 parseHash should be able to parse the profile
[14:12:36]:     ---
[14:12:36]:         message: >
[14:12:36]:             The value of the property 'Auth0' is null or undefined, not a Function object
[14:12:36]:     ...
[14:12:36]: not ok 85 IE 9.0 - Auth0 parseHash should be able to parse the profile (if it starts with a slash)
[14:12:36]:     ---
[14:12:36]:         message: >
[14:12:36]:             The value of the property 'Auth0' is null or undefined, not a Function object
[14:12:36]:     ...
[14:12:36]: not ok 86 IE 9.0 - Auth0 parseHash should return error if iss is invalid
[14:12:36]:     ---
[14:12:36]:         message: >
[14:12:36]:             The value of the property 'Auth0' is null or undefined, not a Function object
[14:12:36]:     ...
[14:12:36]: not ok 87 IE 9.0 - Auth0 parseHash should return an error if aud is invalid
[14:12:36]:     ---
[14:12:36]:         message: >
[14:12:36]:             The value of the property 'Auth0' is null or undefined, not a Function object
[14:12:36]:     ...
[14:12:36]: not ok 88 IE 9.0 - Auth0 parseHash should be able to parse an error
[14:12:36]:     ---
[14:12:36]:         message: >
[14:12:36]:             The value of the property 'Auth0' is null or undefined, not a Function object
[14:12:36]:     ...
[14:12:36]: not ok 89 IE 9.0 - Auth0 parseHash should be able to parse an error (if it starts with a slash)
[14:12:36]:     ---
[14:12:36]:         message: >
[14:12:36]:             The value of the property 'Auth0' is null or undefined, not a Function object
[14:12:36]:     ...
[14:12:36]: not ok 90 IE 9.0 - Auth0 parseHash should return null if the hash URL doesn't contain access_token/error
[14:12:36]:     ---
[14:12:36]:         message: >
[14:12:36]:             The value of the property 'Auth0' is null or undefined, not a Function object
[14:12:36]:     ...
[14:12:36]: not ok 91 IE 9.0 - Auth0 getProfile when called with an object should call the callback with error
[14:12:36]:     ---
[14:12:36]:         message: >
[14:12:36]:             The value of the property 'Auth0' is null or undefined, not a Function object
[14:12:36]:     ...
[14:12:36]: not ok 92 IE 9.0 - Auth0 getProfile when called with an null should call the callback with error
[14:12:36]:     ---
[14:12:36]:         message: >
[14:12:36]:             The value of the property 'Auth0' is null or undefined, not a Function object
[14:12:36]:     ...
[14:12:36]: not ok 93 IE 9.0 - Auth0 getProfile from token should be able to decode the id_token (if scope=openid profile)
[14:12:36]:     ---
[14:12:36]:         message: >
[14:12:36]:             The value of the property 'Auth0' is null or undefined, not a Function object
[14:12:36]:     ...
[14:12:36]: not ok 94 IE 9.0 - Auth0 getProfile from token should be able to take the id_token (scope=openid) and call getUserInfo
[14:12:36]:     ---
[14:12:36]:         message: >
[14:12:36]:             The value of the property 'Auth0' is null or undefined, not a Function object
[14:12:36]:     ...
[14:12:36]: not ok 95 IE 9.0 - Auth0 getDelegationToken Auth0 - User And Passwords logout should redirect to the logout url
[14:12:36]:     ---
[14:12:36]:         message: >
[14:12:36]:             The value of the property 'Auth0' is null or undefined, not a Function object
[14:12:36]:     ...
[14:12:36]: not ok 96 IE 9.0 - Auth0 getDelegationToken Auth0 - User And Passwords logout should redirect to the logout url with params
[14:12:36]:     ---
[14:12:36]:         message: >
[14:12:36]:             The value of the property 'Auth0' is null or undefined, not a Function object
[14:12:36]:     ...
[14:13:51]: not ok 97 IE 10.0 - Auth0 should fail to construct without a clientID
[14:13:51]:     ---
[14:13:51]:         message: >
[14:13:51]:             expected '\'Auth0\' is undefined' to match /clientID is required/
[14:13:51]:         stack: >
[14:13:51]:             Error: expected '\'Auth0\' is undefined' to match /clientID is required/
[14:13:51]:                at assert (http://localhost:7357/node_modules/expect.js/expect.js:99:7)
[14:13:51]:                at match (http://localhost:7357/node_modules/expect.js/expect.js:310:5)
[14:13:51]:                at throwException (http://localhost:7357/node_modules/expect.js/expect.js:142:11)
[14:13:51]:                at Anonymous function (http://localhost:7357/test/tests.js:8:5)
[14:13:51]:                at run (http://localhost:7357/node_modules/mocha/mocha.js:4217:24)
[14:13:51]:                at runTest (http://localhost:7357/node_modules/mocha/mocha.js:4591:5)
[14:13:51]:                at Anonymous function (http://localhost:7357/node_modules/mocha/mocha.js:4637:7)
[14:13:51]:                at next (http://localhost:7357/node_modules/mocha/mocha.js:4517:7)
[14:13:51]:                at Anonymous function (http://localhost:7357/node_modules/mocha/mocha.js:4526:7)
[14:13:51]:                at next (http://localhost:7357/node_modules/mocha/mocha.js:4470:16)
[14:13:51]:     ...
[14:13:51]: not ok 98 IE 10.0 - Auth0 should fail to construct without a callbackURL
[14:13:51]:     ---
[14:13:51]:         message: >
[14:13:51]:             expected '\'Auth0\' is undefined' to match /callbackURL is required/
[14:13:51]:         stack: >
[14:13:51]:             Error: expected '\'Auth0\' is undefined' to match /callbackURL is required/
[14:13:51]:                at assert (http://localhost:7357/node_modules/expect.js/expect.js:99:7)
[14:13:51]:                at match (http://localhost:7357/node_modules/expect.js/expect.js:310:5)
[14:13:51]:                at throwException (http://localhost:7357/node_modules/expect.js/expect.js:142:11)
[14:13:51]:                at Anonymous function (http://localhost:7357/test/tests.js:14:5)
[14:13:51]:                at run (http://localhost:7357/node_modules/mocha/mocha.js:4217:24)
[14:13:51]:                at runTest (http://localhost:7357/node_modules/mocha/mocha.js:4591:5)
[14:13:51]:                at Anonymous function (http://localhost:7357/node_modules/mocha/mocha.js:4637:7)
[14:13:51]:                at next (http://localhost:7357/node_modules/mocha/mocha.js:4517:7)
[14:13:51]:                at Anonymous function (http://localhost:7357/node_modules/mocha/mocha.js:4526:7)
[14:13:51]:                at next (http://localhost:7357/node_modules/mocha/mocha.js:4470:16)
[14:13:51]:     ...
[14:13:51]: not ok 99 IE 10.0 - Auth0 should fail to construct without a domain
[14:13:51]:     ---
[14:13:51]:         message: >
[14:13:51]:             expected '\'Auth0\' is undefined' to match /domain is required/
[14:13:51]:         stack: >
[14:13:51]:             Error: expected '\'Auth0\' is undefined' to match /domain is required/
[14:13:51]:                at assert (http://localhost:7357/node_modules/expect.js/expect.js:99:7)
[14:13:51]:                at match (http://localhost:7357/node_modules/expect.js/expect.js:310:5)
[14:13:51]:                at throwException (http://localhost:7357/node_modules/expect.js/expect.js:142:11)
[14:13:51]:                at Anonymous function (http://localhost:7357/test/tests.js:20:5)
[14:13:51]:                at run (http://localhost:7357/node_modules/mocha/mocha.js:4217:24)
[14:13:51]:                at runTest (http://localhost:7357/node_modules/mocha/mocha.js:4591:5)
[14:13:51]:                at Anonymous function (http://localhost:7357/node_modules/mocha/mocha.js:4637:7)
[14:13:51]:                at next (http://localhost:7357/node_modules/mocha/mocha.js:4517:7)
[14:13:51]:                at Anonymous function (http://localhost:7357/node_modules/mocha/mocha.js:4526:7)
[14:13:51]:                at next (http://localhost:7357/node_modules/mocha/mocha.js:4470:16)
[14:13:51]:     ...
[14:13:51]: not ok 100 IE 10.0 - Auth0 should force constructor
[14:13:51]:     ---
[14:13:51]:         message: >
[14:13:51]:             'Auth0' is undefined
[14:13:51]:         stack: >
[14:13:51]:             ReferenceError: 'Auth0' is undefined
[14:13:51]:                at Anonymous function (http://localhost:7357/test/tests.js:26:5)
[14:13:51]:                at run (http://localhost:7357/node_modules/mocha/mocha.js:4217:24)
[14:13:51]:                at runTest (http://localhost:7357/node_modules/mocha/mocha.js:4591:5)
[14:13:51]:                at Anonymous function (http://localhost:7357/node_modules/mocha/mocha.js:4637:7)
[14:13:51]:                at next (http://localhost:7357/node_modules/mocha/mocha.js:4517:7)
[14:13:51]:                at Anonymous function (http://localhost:7357/node_modules/mocha/mocha.js:4526:7)
[14:13:51]:                at next (http://localhost:7357/node_modules/mocha/mocha.js:4470:16)
[14:13:51]:                at Anonymous function (http://localhost:7357/node_modules/mocha/mocha.js:4494:5)
[14:13:51]:                at timeslice (http://localhost:7357/node_modules/mocha/mocha.js:5487:5)
[14:13:51]:     ...
[14:13:51]: not ok 101 IE 10.0 - Auth0 should redirect to /authorize with google (callbackOnLocationHash: on)
[14:13:51]:     ---
[14:13:51]:         message: >
[14:13:51]:             'Auth0' is undefined
[14:13:51]:         stack: >
[14:13:51]:             ReferenceError: 'Auth0' is undefined
[14:13:51]:                at Anonymous function (http://localhost:7357/test/tests.js:38:5)
[14:13:51]:                at run (http://localhost:7357/node_modules/mocha/mocha.js:4200:7)
[14:13:51]:                at runTest (http://localhost:7357/node_modules/mocha/mocha.js:4591:5)
[14:13:51]:                at Anonymous function (http://localhost:7357/node_modules/mocha/mocha.js:4637:7)
[14:13:51]:                at next (http://localhost:7357/node_modules/mocha/mocha.js:4517:7)
[14:13:51]:                at Anonymous function (http://localhost:7357/node_modules/mocha/mocha.js:4526:7)
[14:13:51]:                at next (http://localhost:7357/node_modules/mocha/mocha.js:4470:16)
[14:13:51]:                at Anonymous function (http://localhost:7357/node_modules/mocha/mocha.js:4494:5)
[14:13:51]:                at timeslice (http://localhost:7357/node_modules/mocha/mocha.js:5487:5)
[14:13:51]:     ...
[14:13:51]: not ok 102 IE 10.0 - Auth0 should fail if auth0.login is called with {popup: true} and without callback
[14:13:51]:     ---
[14:13:51]:         message: >
[14:13:51]:             'Auth0' is undefined
[14:13:51]:         stack: >
[14:13:51]:             ReferenceError: 'Auth0' is undefined
[14:13:51]:                at Anonymous function (http://localhost:7357/test/tests.js:68:5)
[14:13:51]:                at run (http://localhost:7357/node_modules/mocha/mocha.js:4217:24)
[14:13:51]:                at runTest (http://localhost:7357/node_modules/mocha/mocha.js:4591:5)
[14:13:51]:                at Anonymous function (http://localhost:7357/node_modules/mocha/mocha.js:4637:7)
[14:13:51]:                at next (http://localhost:7357/node_modules/mocha/mocha.js:4517:7)
[14:13:51]:                at Anonymous function (http://localhost:7357/node_modules/mocha/mocha.js:4526:7)
[14:13:51]:                at next (http://localhost:7357/node_modules/mocha/mocha.js:4470:16)
[14:13:51]:                at Anonymous function (http://localhost:7357/node_modules/mocha/mocha.js:4494:5)
[14:13:51]:                at timeslice (http://localhost:7357/node_modules/mocha/mocha.js:5487:5)
[14:13:51]:     ...
[14:13:51]: not ok 103 IE 10.0 - Auth0 should fail if auth0.loginWithPopup is called without callback
[14:13:51]:     ---
[14:13:51]:         message: >
[14:13:51]:             'Auth0' is undefined
[14:13:51]:         stack: >
[14:13:51]:             ReferenceError: 'Auth0' is undefined
[14:13:51]:                at Anonymous function (http://localhost:7357/test/tests.js:81:5)
[14:13:51]:                at run (http://localhost:7357/node_modules/mocha/mocha.js:4217:24)
[14:13:51]:                at runTest (http://localhost:7357/node_modules/mocha/mocha.js:4591:5)
[14:13:51]:                at Anonymous function (http://localhost:7357/node_modules/mocha/mocha.js:4637:7)
[14:13:51]:                at next (http://localhost:7357/node_modules/mocha/mocha.js:4517:7)
[14:13:51]:                at Anonymous function (http://localhost:7357/node_modules/mocha/mocha.js:4526:7)
[14:13:51]:                at next (http://localhost:7357/node_modules/mocha/mocha.js:4470:16)
[14:13:51]:                at Anonymous function (http://localhost:7357/node_modules/mocha/mocha.js:4494:5)
[14:13:51]:                at timeslice (http://localhost:7357/node_modules/mocha/mocha.js:5487:5)
[14:13:51]:     ...
[14:13:51]: not ok 104 IE 10.0 - Auth0 should support to use signin as an alias for login
[14:13:51]:     ---
[14:13:51]:         message: >
[14:13:51]:             'Auth0' is undefined
[14:13:51]:         stack: >
[14:13:51]:             ReferenceError: 'Auth0' is undefined
[14:13:51]:                at Anonymous function (http://localhost:7357/test/tests.js:95:5)
[14:13:51]:                at run (http://localhost:7357/node_modules/mocha/mocha.js:4217:24)
[14:13:51]:                at runTest (http://localhost:7357/node_modules/mocha/mocha.js:4591:5)
[14:13:51]:                at Anonymous function (http://localhost:7357/node_modules/mocha/mocha.js:4637:7)
[14:13:51]:                at next (http://localhost:7357/node_modules/mocha/mocha.js:4517:7)
[14:13:51]:                at Anonymous function (http://localhost:7357/node_modules/mocha/mocha.js:4526:7)
[14:13:51]:                at next (http://localhost:7357/node_modules/mocha/mocha.js:4470:16)
[14:13:51]:                at Anonymous function (http://localhost:7357/node_modules/mocha/mocha.js:4494:5)
[14:13:51]:                at timeslice (http://localhost:7357/node_modules/mocha/mocha.js:5487:5)
[14:13:51]:     ...
[14:13:51]: not ok 105 IE 10.0 - Auth0 should redirect to /authorize with google (callbackOnLocationHash: off)
[14:13:51]:     ---
[14:13:51]:         message: >
[14:13:51]:             'Auth0' is undefined
[14:13:51]:         stack: >
[14:13:51]:             ReferenceError: 'Auth0' is undefined
[14:13:51]:                at Anonymous function (http://localhost:7357/test/tests.js:106:5)
[14:13:51]:                at run (http://localhost:7357/node_modules/mocha/mocha.js:4200:7)
[14:13:51]:                at runTest (http://localhost:7357/node_modules/mocha/mocha.js:4591:5)
[14:13:51]:                at Anonymous function (http://localhost:7357/node_modules/mocha/mocha.js:4637:7)
[14:13:51]:                at next (http://localhost:7357/node_modules/mocha/mocha.js:4517:7)
[14:13:51]:                at Anonymous function (http://localhost:7357/node_modules/mocha/mocha.js:4526:7)
[14:13:51]:                at next (http://localhost:7357/node_modules/mocha/mocha.js:4470:16)
[14:13:51]:                at Anonymous function (http://localhost:7357/node_modules/mocha/mocha.js:4494:5)
[14:13:51]:                at timeslice (http://localhost:7357/node_modules/mocha/mocha.js:5487:5)
[14:13:51]:     ...
[14:13:51]: not ok 106 IE 10.0 - Auth0 should return SSO data
[14:13:51]:     ---
[14:13:51]:         message: >
[14:13:51]:             'Auth0' is undefined
[14:13:51]:         stack: >
[14:13:51]:             ReferenceError: 'Auth0' is undefined
[14:13:51]:                at Anonymous function (http://localhost:7357/test/tests.js:327:5)
[14:13:51]:                at run (http://localhost:7357/node_modules/mocha/mocha.js:4200:7)
[14:13:51]:                at runTest (http://localhost:7357/node_modules/mocha/mocha.js:4591:5)
[14:13:51]:                at Anonymous function (http://localhost:7357/node_modules/mocha/mocha.js:4637:7)
[14:13:51]:                at next (http://localhost:7357/node_modules/mocha/mocha.js:4517:7)
[14:13:51]:                at Anonymous function (http://localhost:7357/node_modules/mocha/mocha.js:4526:7)
[14:13:51]:                at next (http://localhost:7357/node_modules/mocha/mocha.js:4470:16)
[14:13:51]:                at Anonymous function (http://localhost:7357/node_modules/mocha/mocha.js:4494:5)
[14:13:51]:                at timeslice (http://localhost:7357/node_modules/mocha/mocha.js:5487:5)
[14:13:51]:     ...
[14:13:51]: not ok 107 IE 10.0 - Auth0 should return configured connections
[14:13:51]:     ---
[14:13:51]:         message: >
[14:13:51]:             'Auth0' is undefined
[14:13:51]:         stack: >
[14:13:51]:             ReferenceError: 'Auth0' is undefined
[14:13:51]:                at Anonymous function (http://localhost:7357/test/tests.js:340:5)
[14:13:51]:                at run (http://localhost:7357/node_modules/mocha/mocha.js:4200:7)
[14:13:51]:                at runTest (http://localhost:7357/node_modules/mocha/mocha.js:4591:5)
[14:13:51]:                at Anonymous function (http://localhost:7357/node_modules/mocha/mocha.js:4637:7)
[14:13:51]:                at next (http://localhost:7357/node_modules/mocha/mocha.js:4517:7)
[14:13:51]:                at Anonymous function (http://localhost:7357/node_modules/mocha/mocha.js:4526:7)
[14:13:51]:                at next (http://localhost:7357/node_modules/mocha/mocha.js:4470:16)
[14:13:51]:                at Anonymous function (http://localhost:7357/node_modules/mocha/mocha.js:4494:5)
[14:13:51]:                at timeslice (http://localhost:7357/node_modules/mocha/mocha.js:5487:5)
[14:13:51]:     ...
[14:13:51]: not ok 108 IE 10.0 - Auth0 parseHash should be able to parse the profile
[14:13:51]:     ---
[14:13:51]:         message: >
[14:13:51]:             'Auth0' is undefined
[14:13:51]:         stack: >
[14:13:51]:             ReferenceError: 'Auth0' is undefined
[14:13:51]:                at Anonymous function (http://localhost:7357/test/tests.js:139:7)
[14:13:51]:                at run (http://localhost:7357/node_modules/mocha/mocha.js:4217:24)
[14:13:51]:                at runTest (http://localhost:7357/node_modules/mocha/mocha.js:4591:5)
[14:13:51]:                at Anonymous function (http://localhost:7357/node_modules/mocha/mocha.js:4637:7)
[14:13:51]:                at next (http://localhost:7357/node_modules/mocha/mocha.js:4517:7)
[14:13:51]:                at Anonymous function (http://localhost:7357/node_modules/mocha/mocha.js:4526:7)
[14:13:51]:                at next (http://localhost:7357/node_modules/mocha/mocha.js:4470:16)
[14:13:51]:                at Anonymous function (http://localhost:7357/node_modules/mocha/mocha.js:4494:5)
[14:13:51]:                at timeslice (http://localhost:7357/node_modules/mocha/mocha.js:5487:5)
[14:13:51]:     ...
[14:13:51]: not ok 109 IE 10.0 - Auth0 parseHash should be able to parse the profile (if it starts with a slash)
[14:13:51]:     ---
[14:13:51]:         message: >
[14:13:51]:             'Auth0' is undefined
[14:13:51]:         stack: >
[14:13:51]:             ReferenceError: 'Auth0' is undefined
[14:13:51]:                at Anonymous function (http://localhost:7357/test/tests.js:155:7)
[14:13:51]:                at run (http://localhost:7357/node_modules/mocha/mocha.js:4217:24)
[14:13:51]:                at runTest (http://localhost:7357/node_modules/mocha/mocha.js:4591:5)
[14:13:51]:                at Anonymous function (http://localhost:7357/node_modules/mocha/mocha.js:4637:7)
[14:13:51]:                at next (http://localhost:7357/node_modules/mocha/mocha.js:4517:7)
[14:13:51]:                at Anonymous function (http://localhost:7357/node_modules/mocha/mocha.js:4526:7)
[14:13:51]:                at next (http://localhost:7357/node_modules/mocha/mocha.js:4470:16)
[14:13:51]:                at Anonymous function (http://localhost:7357/node_modules/mocha/mocha.js:4494:5)
[14:13:51]:                at timeslice (http://localhost:7357/node_modules/mocha/mocha.js:5487:5)
[14:13:51]:     ...
[14:13:51]: not ok 110 IE 10.0 - Auth0 parseHash should return error if iss is invalid
[14:13:51]:     ---
[14:13:51]:         message: >
[14:13:51]:             'Auth0' is undefined
[14:13:51]:         stack: >
[14:13:51]:             ReferenceError: 'Auth0' is undefined
[14:13:51]:                at Anonymous function (http://localhost:7357/test/tests.js:171:7)
[14:13:51]:                at run (http://localhost:7357/node_modules/mocha/mocha.js:4217:24)
[14:13:51]:                at runTest (http://localhost:7357/node_modules/mocha/mocha.js:4591:5)
[14:13:51]:                at Anonymous function (http://localhost:7357/node_modules/mocha/mocha.js:4637:7)
[14:13:51]:                at next (http://localhost:7357/node_modules/mocha/mocha.js:4517:7)
[14:13:51]:                at Anonymous function (http://localhost:7357/node_modules/mocha/mocha.js:4526:7)
[14:13:51]:                at next (http://localhost:7357/node_modules/mocha/mocha.js:4470:16)
[14:13:51]:                at Anonymous function (http://localhost:7357/node_modules/mocha/mocha.js:4494:5)
[14:13:51]:                at timeslice (http://localhost:7357/node_modules/mocha/mocha.js:5487:5)
[14:13:51]:     ...
[14:13:51]: not ok 111 IE 10.0 - Auth0 parseHash should return an error if aud is invalid
[14:13:51]:     ---
[14:13:51]:         message: >
[14:13:51]:             'Auth0' is undefined
[14:13:51]:         stack: >
[14:13:51]:             ReferenceError: 'Auth0' is undefined
[14:13:51]:                at Anonymous function (http://localhost:7357/test/tests.js:186:7)
[14:13:51]:                at run (http://localhost:7357/node_modules/mocha/mocha.js:4217:24)
[14:13:51]:                at runTest (http://localhost:7357/node_modules/mocha/mocha.js:4591:5)
[14:13:51]:                at Anonymous function (http://localhost:7357/node_modules/mocha/mocha.js:4637:7)
[14:13:51]:                at next (http://localhost:7357/node_modules/mocha/mocha.js:4517:7)
[14:13:51]:                at Anonymous function (http://localhost:7357/node_modules/mocha/mocha.js:4526:7)
[14:13:51]:                at next (http://localhost:7357/node_modules/mocha/mocha.js:4470:16)
[14:13:51]:                at Anonymous function (http://localhost:7357/node_modules/mocha/mocha.js:4494:5)
[14:13:51]:                at timeslice (http://localhost:7357/node_modules/mocha/mocha.js:5487:5)
[14:13:51]:     ...
[14:13:51]: not ok 112 IE 10.0 - Auth0 parseHash should be able to parse an error
[14:13:51]:     ---
[14:13:51]:         message: >
[14:13:51]:             'Auth0' is undefined
[14:13:51]:         stack: >
[14:13:51]:             ReferenceError: 'Auth0' is undefined
[14:13:51]:                at Anonymous function (http://localhost:7357/test/tests.js:201:7)
[14:13:51]:                at run (http://localhost:7357/node_modules/mocha/mocha.js:4217:24)
[14:13:51]:                at runTest (http://localhost:7357/node_modules/mocha/mocha.js:4591:5)
[14:13:51]:                at Anonymous function (http://localhost:7357/node_modules/mocha/mocha.js:4637:7)
[14:13:51]:                at next (http://localhost:7357/node_modules/mocha/mocha.js:4517:7)
[14:13:51]:                at Anonymous function (http://localhost:7357/node_modules/mocha/mocha.js:4526:7)
[14:13:51]:                at next (http://localhost:7357/node_modules/mocha/mocha.js:4470:16)
[14:13:51]:                at Anonymous function (http://localhost:7357/node_modules/mocha/mocha.js:4494:5)
[14:13:51]:                at timeslice (http://localhost:7357/node_modules/mocha/mocha.js:5487:5)
[14:13:51]:     ...
[14:13:52]: not ok 113 IE 10.0 - Auth0 parseHash should be able to parse an error (if it starts with a slash)
[14:13:52]:     ---
[14:13:52]:         message: >
[14:13:52]:             'Auth0' is undefined
[14:13:52]:         stack: >
[14:13:52]:             ReferenceError: 'Auth0' is undefined
[14:13:52]:                at Anonymous function (http://localhost:7357/test/tests.js:216:7)
[14:13:52]:                at run (http://localhost:7357/node_modules/mocha/mocha.js:4217:24)
[14:13:52]:                at runTest (http://localhost:7357/node_modules/mocha/mocha.js:4591:5)
[14:13:52]:                at Anonymous function (http://localhost:7357/node_modules/mocha/mocha.js:4637:7)
[14:13:52]:                at next (http://localhost:7357/node_modules/mocha/mocha.js:4517:7)
[14:13:52]:                at Anonymous function (http://localhost:7357/node_modules/mocha/mocha.js:4526:7)
[14:13:52]:                at next (http://localhost:7357/node_modules/mocha/mocha.js:4470:16)
[14:13:52]:                at Anonymous function (http://localhost:7357/node_modules/mocha/mocha.js:4494:5)
[14:13:52]:                at timeslice (http://localhost:7357/node_modules/mocha/mocha.js:5487:5)
[14:13:52]:     ...
[14:13:52]: not ok 114 IE 10.0 - Auth0 parseHash should return null if the hash URL doesn't contain access_token/error
[14:13:52]:     ---
[14:13:52]:         message: >
[14:13:52]:             'Auth0' is undefined
[14:13:52]:         stack: >
[14:13:52]:             ReferenceError: 'Auth0' is undefined
[14:13:52]:                at Anonymous function (http://localhost:7357/test/tests.js:237:7)
[14:13:52]:                at run (http://localhost:7357/node_modules/mocha/mocha.js:4217:24)
[14:13:52]:                at runTest (http://localhost:7357/node_modules/mocha/mocha.js:4591:5)
[14:13:52]:                at Anonymous function (http://localhost:7357/node_modules/mocha/mocha.js:4637:7)
[14:13:52]:                at next (http://localhost:7357/node_modules/mocha/mocha.js:4517:7)
[14:13:52]:                at Anonymous function (http://localhost:7357/node_modules/mocha/mocha.js:4526:7)
[14:13:52]:                at next (http://localhost:7357/node_modules/mocha/mocha.js:4470:16)
[14:13:52]:                at Anonymous function (http://localhost:7357/node_modules/mocha/mocha.js:4494:5)
[14:13:52]:                at timeslice (http://localhost:7357/node_modules/mocha/mocha.js:5487:5)
[14:13:52]:     ...
[14:13:52]: not ok 115 IE 10.0 - Auth0 getProfile when called with an object should call the callback with error
[14:13:52]:     ---
[14:13:52]:         message: >
[14:13:52]:             'Auth0' is undefined
[14:13:52]:         stack: >
[14:13:52]:             ReferenceError: 'Auth0' is undefined
[14:13:52]:                at Anonymous function (http://localhost:7357/test/tests.js:253:9)
[14:13:52]:                at run (http://localhost:7357/node_modules/mocha/mocha.js:4200:7)
[14:13:52]:                at runTest (http://localhost:7357/node_modules/mocha/mocha.js:4591:5)
[14:13:52]:                at Anonymous function (http://localhost:7357/node_modules/mocha/mocha.js:4637:7)
[14:13:52]:                at next (http://localhost:7357/node_modules/mocha/mocha.js:4517:7)
[14:13:52]:                at Anonymous function (http://localhost:7357/node_modules/mocha/mocha.js:4526:7)
[14:13:52]:                at next (http://localhost:7357/node_modules/mocha/mocha.js:4470:16)
[14:13:52]:                at Anonymous function (http://localhost:7357/node_modules/mocha/mocha.js:4494:5)
[14:13:52]:                at timeslice (http://localhost:7357/node_modules/mocha/mocha.js:5487:5)
[14:13:52]:     ...
[14:13:52]: not ok 116 IE 10.0 - Auth0 getProfile when called with an null should call the callback with error
[14:13:52]:     ---
[14:13:52]:         message: >
[14:13:52]:             'Auth0' is undefined
[14:13:52]:         stack: >
[14:13:52]:             ReferenceError: 'Auth0' is undefined
[14:13:52]:                at Anonymous function (http://localhost:7357/test/tests.js:268:9)
[14:13:52]:                at run (http://localhost:7357/node_modules/mocha/mocha.js:4200:7)
[14:13:52]:                at runTest (http://localhost:7357/node_modules/mocha/mocha.js:4591:5)
[14:13:52]:                at Anonymous function (http://localhost:7357/node_modules/mocha/mocha.js:4637:7)
[14:13:52]:                at next (http://localhost:7357/node_modules/mocha/mocha.js:4517:7)
[14:13:52]:                at Anonymous function (http://localhost:7357/node_modules/mocha/mocha.js:4526:7)
[14:13:52]:                at next (http://localhost:7357/node_modules/mocha/mocha.js:4470:16)
[14:13:52]:                at Anonymous function (http://localhost:7357/node_modules/mocha/mocha.js:4494:5)
[14:13:52]:                at timeslice (http://localhost:7357/node_modules/mocha/mocha.js:5487:5)
[14:13:52]:     ...
[14:13:52]: not ok 117 IE 10.0 - Auth0 getProfile from token should be able to decode the id_token (if scope=openid profile)
[14:13:52]:     ---
[14:13:52]:         message: >
[14:13:52]:             'Auth0' is undefined
[14:13:52]:         stack: >
[14:13:52]:             ReferenceError: 'Auth0' is undefined
[14:13:52]:                at Anonymous function (http://localhost:7357/test/tests.js:284:9)
[14:13:52]:                at run (http://localhost:7357/node_modules/mocha/mocha.js:4200:7)
[14:13:52]:                at runTest (http://localhost:7357/node_modules/mocha/mocha.js:4591:5)
[14:13:52]:                at Anonymous function (http://localhost:7357/node_modules/mocha/mocha.js:4637:7)
[14:13:52]:                at next (http://localhost:7357/node_modules/mocha/mocha.js:4517:7)
[14:13:52]:                at Anonymous function (http://localhost:7357/node_modules/mocha/mocha.js:4526:7)
[14:13:52]:                at next (http://localhost:7357/node_modules/mocha/mocha.js:4470:16)
[14:13:52]:                at Anonymous function (http://localhost:7357/node_modules/mocha/mocha.js:4494:5)
[14:13:52]:                at timeslice (http://localhost:7357/node_modules/mocha/mocha.js:5487:5)
[14:13:52]:     ...
[14:13:52]: not ok 118 IE 10.0 - Auth0 getProfile from token should be able to take the id_token (scope=openid) and call getUserInfo
[14:13:52]:     ---
[14:13:52]:         message: >
[14:13:52]:             'Auth0' is undefined
[14:13:52]:         stack: >
[14:13:52]:             ReferenceError: 'Auth0' is undefined
[14:13:52]:                at Anonymous function (http://localhost:7357/test/tests.js:304:9)
[14:13:52]:                at run (http://localhost:7357/node_modules/mocha/mocha.js:4200:7)
[14:13:52]:                at runTest (http://localhost:7357/node_modules/mocha/mocha.js:4591:5)
[14:13:52]:                at Anonymous function (http://localhost:7357/node_modules/mocha/mocha.js:4637:7)
[14:13:52]:                at next (http://localhost:7357/node_modules/mocha/mocha.js:4517:7)
[14:13:52]:                at Anonymous function (http://localhost:7357/node_modules/mocha/mocha.js:4526:7)
[14:13:52]:                at next (http://localhost:7357/node_modules/mocha/mocha.js:4470:16)
[14:13:52]:                at Anonymous function (http://localhost:7357/node_modules/mocha/mocha.js:4494:5)
[14:13:52]:                at timeslice (http://localhost:7357/node_modules/mocha/mocha.js:5487:5)
[14:13:52]:     ...
[14:13:52]: not ok 119 IE 10.0 - Auth0 getDelegationToken Auth0 - User And Passwords logout should redirect to the logout url
[14:13:52]:     ---
[14:13:52]:         message: >
[14:13:52]:             'Auth0' is undefined
[14:13:52]:         stack: >
[14:13:52]:             ReferenceError: 'Auth0' is undefined
[14:13:52]:                at Anonymous function (http://localhost:7357/test/logout.js:3:5)
[14:13:52]:                at run (http://localhost:7357/node_modules/mocha/mocha.js:4200:7)
[14:13:52]:                at runTest (http://localhost:7357/node_modules/mocha/mocha.js:4591:5)
[14:13:52]:                at Anonymous function (http://localhost:7357/node_modules/mocha/mocha.js:4637:7)
[14:13:52]:                at next (http://localhost:7357/node_modules/mocha/mocha.js:4517:7)
[14:13:52]:                at Anonymous function (http://localhost:7357/node_modules/mocha/mocha.js:4526:7)
[14:13:52]:                at next (http://localhost:7357/node_modules/mocha/mocha.js:4470:16)
[14:13:52]:                at Anonymous function (http://localhost:7357/node_modules/mocha/mocha.js:4494:5)
[14:13:52]:                at timeslice (http://localhost:7357/node_modules/mocha/mocha.js:5487:5)
[14:13:52]:     ...
[14:13:52]: not ok 120 IE 10.0 - Auth0 getDelegationToken Auth0 - User And Passwords logout should redirect to the logout url with params
[14:13:52]:     ---
[14:13:52]:         message: >
[14:13:52]:             'Auth0' is undefined
[14:13:52]:         stack: >
[14:13:52]:             ReferenceError: 'Auth0' is undefined
[14:13:52]:                at Anonymous function (http://localhost:7357/test/logout.js:18:5)
[14:13:52]:                at run (http://localhost:7357/node_modules/mocha/mocha.js:4200:7)
[14:13:52]:                at runTest (http://localhost:7357/node_modules/mocha/mocha.js:4591:5)
[14:13:52]:                at Anonymous function (http://localhost:7357/node_modules/mocha/mocha.js:4637:7)
[14:13:52]:                at next (http://localhost:7357/node_modules/mocha/mocha.js:4517:7)
[14:13:52]:                at Anonymous function (http://localhost:7357/node_modules/mocha/mocha.js:4526:7)
[14:13:52]:                at next (http://localhost:7357/node_modules/mocha/mocha.js:4470:16)
[14:13:52]:                at Anonymous function (http://localhost:7357/node_modules/mocha/mocha.js:4494:5)
[14:13:52]:                at timeslice (http://localhost:7357/node_modules/mocha/mocha.js:5487:5)
[14:13:52]:     ...
[14:13:52]: 
[14:13:52]: 1..120
[14:13:52]: # tests 120
[14:13:52]: # pass  0
[14:13:52]: # fail  120
[14:13:53]:  >>  Exited with code: 1.
[14:13:53]:  Warning: Task "exec:test-desktop" failed.  Use --force to continue. 
[14:13:53]: 
[14:13:53]:  Aborted due to warnings. 
[14:13:53]: npm ERR! Test failed.  See above for more details.
[14:13:53]: npm ERR! not ok code 0
[14:13:53]: Uploading to the CDN
[14:13:54]:  >>  Local Npm module "grunt-cli" not found. Is it installed?
[14:13:55]: 
[14:13:55]:  Running "clean:build" (clean) task 
[14:13:55]: Cleaning build/... OK 
[14:13:55]: Cleaning example/auth0.js... OK 
[14:13:55]: 
[14:13:55]:  Running "browserify:dist" (browserify) task 
[14:13:55]:  >>  Bundled build/auth0.js
[14:13:55]: 
[14:13:55]:  Running "uglify:min" (uglify) task 
[14:13:56]: File "build/auth0.min.js" created.
[14:13:56]: 
[14:13:56]:  Running "copy:example" (copy) task 
[14:13:56]: Copied  1  files
[14:13:56]: 
[14:13:56]:  Running "copy:release" (copy) task 
[14:13:56]: Copied  6  files
[14:13:56]: 
[14:13:56]:  Running "s3:clean" (s3) task 
[14:13:56]:  >>   ���  Deleted: w2/auth0-2.0.12.min.js
[14:13:56]:  >>   ���  Deleted: w2/auth0-2.0.min.js
[14:13:56]:  >>   ���  Deleted: w2/auth0-2.min.js
[14:13:56]:  >>   ���  Deleted: w2/auth0-2.0.12.js
[14:13:56]:  >>   ���  Deleted: w2/auth0-2.js
[14:13:56]:  >>   ���  Deleted: w2/auth0-2.0.js
[14:13:56]: 
[14:13:56]:  Running "s3:publish" (s3) task 
[14:13:56]:  >>   ���  Uploaded: release/auth0-2.0.12.min.js (gzip) (25cfae0c3925b840c45c37668323d5c4)
[14:13:56]:  >>   ���  Uploaded: release/auth0-2.min.js (gzip) (25cfae0c3925b840c45c37668323d5c4)
[14:13:56]:  >>   ���  Uploaded: release/auth0-2.0.min.js (gzip) (25cfae0c3925b840c45c37668323d5c4)
[14:13:56]:  >>   ���  Uploaded: release/auth0-2.js (gzip) (3142c6323412e29dd9c67a8b896926ab)
[14:13:56]:  >>   ���  Uploaded: release/auth0-2.0.js (gzip) (3142c6323412e29dd9c67a8b896926ab)
[14:13:57]:  >>   ���  Uploaded: release/auth0-2.0.12.js (gzip) (3142c6323412e29dd9c67a8b896926ab)
[14:13:57]: 
[14:13:57]:  Running "maxcdn:purgeCache" (maxcdn) task 
[14:13:57]: Purging cache...
[14:13:57]: 	w2/auth0-2.0.12.min.js
[14:13:57]: 	w2/auth0-2.0.12.js
[14:13:57]: 	w2/auth0-2.js
[14:13:57]: 	w2/auth0-2.min.js
[14:13:57]: 	w2/auth0-2.0.js
[14:13:57]: 	w2/auth0-2.0.min.js
[14:13:58]: { code: 200 }
[14:13:58]: 
[14:13:58]:  Done, without errors. 
[14:13:58]: Process exited with code 0
[14:13:58]: Publishing internal artifacts
[14:13:58]:	 [Publishing internal artifacts] Sending build.finish.properties.gz file
[14:13:58]: Build failure condition: Some tests failed.
[14:13:58]: Build finished